Build:
  1. 0
2026-10-25 01:01.17: New job: build randoml.0.1.5 (4cb89017696a)
2026-10-25 01:01.17: Waiting for resource in pool day11-builds
2026-10-25 02:10.54: Got resource from pool day11-builds
2026-10-25 02:10.54: [profile full] build randoml.0.1.5
2026-10-25 02:10.54: build randoml.0.1.5 (4cb89017696a)
=== DEPENDENCIES (78 transitive) ===
  base.v0.17.3                                       b1ff527613aa
  base-threads.base                                  ca51096a9c5b
  base-unix.base                                     88a83b7ed333
  base_bigstring.v0.17.0                             23c0625cf302
  base_quickcheck.v0.17.1                            baa92084ba76
  bignum.v0.17.0                                     1e0ca5d13533
  bin_prot.v0.17.0-1                                 13385186c6a3
  capitalization.v0.17.0                             c8aab0ba4064
  compiler-cloning.enabled                           1aa529c962c5
  conf-gmp.5                                         d0211a82c71f
  conf-pkg-config.5                                  26be2768a637
  conf-rust-2018.1                                   f79f120b7d35
  core.v0.17.2                                       6fab4aeccea9
  core_kernel.v0.17.0                                c2f92cd75fc9
  csexp.1.5.2                                        a054117ec731
  dune.3.24.2                                        6cd6abc0b8c5
  dune-configurator.3.24.2                           bd4df6cc6c29
  fieldslib.v0.17.0                                  a583ae3cfa30
  gel.v0.17.0                                        737b2a603eed
  int_repr.v0.17.0                                   7106ad951a0b
  jane-street-headers.v0.17.0                        e79285e744ad
  jst-config.v0.17.0                                 f78069049fd4
  num.1.6                                            bf79e8a7f25b
  ocaml.5.5.2                                        3d66d99b0b38
  ocaml-base-compiler.5.5.2                          546a7f1026cd
  ocaml-compiler.5.5.2                               956e368db607
  ocaml-compiler-libs.v0.17.0                        5140a7724d3b
  ocaml_intrinsics_kernel.v0.17.3                    6750f7305423
  ocamlfind.1.9.9~preview                            36cecca1627b
  parsexp.v0.17.0                                    82ae06473f31
  ppx_assert.v0.17.0                                 2b2db77b0d87
  ppx_base.v0.17.0                                   20e034b9fbc4
  ppx_bench.v0.17.1                                  11f86cddcb40
  ppx_bin_prot.v0.17.1                               6a639b64a20a
  ppx_cold.v0.17.0                                   261b0f80c6d2
  ppx_compare.v0.17.0                                6e659291557d
  ppx_custom_printf.v0.17.0                          d9407d62e44b
  ppx_derivers.1.2.1                                 c9a64fb6bb7b
  ppx_diff.v0.17.1                                   cd1a6df44adf
  ppx_disable_unused_warnings.v0.17.0                d6ca843ca6d5
  ppx_enumerate.v0.17.0                              e653471255d1
  ppx_expect.v0.17.3                                 6824d0f60959
  ppx_fields_conv.v0.17.0                            456aed51bafc
  ppx_fixed_literal.v0.17.0                          add8ee3533ac
  ppx_globalize.v0.17.2                              843ce1ff3f3a
  ppx_hash.v0.17.0                                   d305db3c515d
  ppx_here.v0.17.0                                   2e177c680685
  ppx_ignore_instrumentation.v0.17.0                 0c1e376855bf
  ppx_inline_test.v0.17.1                            bbe143ce8aca
  ppx_jane.v0.17.0                                   250d9afb2f22
  ppx_let.v0.17.1                                    5812398ba855
  ppx_log.v0.17.0                                    d829b13bed8c
  ppx_module_timer.v0.17.0                           8c20d691f329
  ppx_optcomp.v0.17.1                                c04fb7c9788b
  ppx_optional.v0.17.0                               d249abf5ea35
  ppx_pipebang.v0.17.0                               b06311f4648b
  ppx_sexp_conv.v0.17.1                              ccedb445c027
  ppx_sexp_message.v0.17.0                           89520847cc71
  ppx_sexp_value.v0.17.0                             2e317dcbccb8
  ppx_stable.v0.17.1                                 7b9e55162fe9
  ppx_stable_witness.v0.17.0                         5d4b6680177f
  ppx_string.v0.17.0                                 73338273f1fa
  ppx_string_conv.v0.17.0                            6aca44d6570d
  ppx_tydi.v0.17.1                                   63d17072b1ad
  ppx_typerep_conv.v0.17.1                           74511ab4fc77
  ppx_variants_conv.v0.17.1                          4c7c3f98d595
  ppxlib.0.39.0                                      4a1e195cb09b
  ppxlib_jane.v0.17.4                                d6c773a3be23
  sexplib.v0.17.0                                    45a881bfc147
  sexplib0.v0.17.0                                   759f5d626115
  splittable_random.v0.17.0                          83c1cb2e960b
  stdio.v0.17.0                                      6dd3d8d58b97
  time_now.v0.17.0                                   b33ac00874a1
  typerep.v0.17.1                                    493ff532cde4
  uopt.v0.17.0                                       325b47c01d68
  variantslib.v0.17.0                                47d6877d373e
  zarith.1.14                                        cbecd38aadee
  zarith_stubs_js.v0.17.0                            7b913fb00ef8
=== STDOUT ===
Processing: [default: loading data]
[randoml.0.1.5: dl]
[randoml.0.1.5: extract]
-> retrieved randoml.0.1.5  (https://opam.ocaml.org/cache)
[randoml: dune build]
+ /home/opam/.opam/default/bin/dune "build" "-p" "randoml" "-j" "39" "@install" (CWD=/home/opam/.opam/default/.opam-switch/build/randoml.0.1.5)
- (cd _build/default && /home/opam/.opam/default/bin/ocamlc.opt -w -40 -g -bin-annot -bin-annot-occurrences -I lib/.randoml.objs/byte -I /home/opam/.opam/default/lib/base -I /home/opam/.opam/default/lib/base/base_internalhash_types -I /home/opam/.opam/default/lib/base/md5 -I /home/opam/.opam/default/lib/base/shadow_stdlib -I /home/opam/.opam/default/lib/base_bigstring -I /home/opam/.opam/default/lib/base_quickcheck -I /home/opam/.opam/default/lib/base_quickcheck/ppx_quickcheck/runtime -I /home/opam/.opam/default/lib/bignum/bigint -I /home/opam/.opam/default/lib/bin_prot -I /home/opam/.opam/default/lib/bin_prot/shape -I /home/opam/.opam/default/lib/core -I /home/opam/.opam/default/lib/core/base_for_tests -I /home/opam/.opam/default/lib/core/command -I /home/opam/.opam/default/lib/core/filename_base -I /home/opam/.opam/default/lib/core/heap_block -I /home/opam/.opam/default/lib/core/univ_map -I /home/opam/.opam/default/lib/core/validate -I /home/opam/.opam/default/lib/core_kernel -I /home/opam/.opam/default/lib/fieldslib -I /home/opam/.opam/default/lib/gel -I /home/opam/.opam/default/lib/int_repr -I /home/opam/.opam/default/lib/jane-street-headers -I /home/opam/.opam/default/lib/num -I /home/opam/.opam/default/lib/ocaml_intrinsics_kernel -I /home/opam/.opam/default/lib/parsexp -I /home/opam/.opam/default/lib/ppx_assert/runtime-lib -I /home/opam/.opam/default/lib/ppx_bench/runtime-lib -I /home/opam/.opam/default/lib/ppx_compare/runtime-lib -I /home/opam/.opam/default/lib/ppx_diff/diffable -I /home/opam/.opam/default/lib/ppx_diff/diffable_cinaps -I /home/opam/.opam/default/lib/ppx_enumerate/runtime-lib -I /home/opam/.opam/default/lib/ppx_expect/config -I /home/opam/.opam/default/lib/ppx_expect/config_types -I /home/opam/.opam/default/lib/ppx_expect/make_corrected_file -I /home/opam/.opam/default/lib/ppx_expect/runtime -I /home/opam/.opam/default/lib/ppx_hash/runtime-lib -I /home/opam/.opam/default/lib/ppx_here/runtime-lib -I /home/opam/.opam/default/lib/ppx_inline_test/config -I /home/opam/.opam/default/lib/ppx_inline_test/runtime-lib -I /home/opam/.opam/default/lib/ppx_log/syntax -I /home/opam/.opam/default/lib/ppx_log/types -I /home/opam/.opam/default/lib/ppx_module_timer/runtime -I /home/opam/.opam/default/lib/ppx_sexp_conv/runtime-lib -I /home/opam/.opam/default/lib/ppx_stable_witness/runtime -I /home/opam/.opam/default/lib/ppx_stable_witness/stable_witness -I /home/opam/.opam/default/lib/ppx_string/runtime -I /home/opam/.opam/default/lib/ppxlib/print_diff -I /home/opam/.opam/default/lib/sexplib -I /home/opam/.opam/default/lib/sexplib0 -I /home/opam/.opam/default/lib/splittable_random -I /home/opam/.opam/default/lib/stdio -I /home/opam/.opam/default/lib/time_now -I /home/opam/.opam/default/lib/typerep -I /home/opam/.opam/default/lib/variantslib -I /home/opam/.opam/default/lib/zarith -I /home/opam/.opam/default/lib/zarith_stubs_js -I lib/rand/.rand.objs/byte -cmi-file lib/.randoml.objs/byte/randoml.cmi -no-alias-deps -o lib/.randoml.objs/byte/randoml.cmo -c -impl lib/randoml.pp.ml)
- File "lib/randoml.ml", line 1, characters 5-16:
- 1 | open Core_kernel
-          ^^^^^^^^^^^
- Alert deprecated: module Core_kernel
- [since 2021-05] Use [Core] -- [Core_kernel] was renamed as [Core]
- (cd _build/default && /home/opam/.opam/default/bin/ocamlopt.opt -w -40 -g -I lib/.randoml.objs/byte -I lib/.randoml.objs/native -I /home/opam/.opam/default/lib/base -I /home/opam/.opam/default/lib/base/base_internalhash_types -I /home/opam/.opam/default/lib/base/md5 -I /home/opam/.opam/default/lib/base/shadow_stdlib -I /home/opam/.opam/default/lib/base_bigstring -I /home/opam/.opam/default/lib/base_quickcheck -I /home/opam/.opam/default/lib/base_quickcheck/ppx_quickcheck/runtime -I /home/opam/.opam/default/lib/bignum/bigint -I /home/opam/.opam/default/lib/bin_prot -I /home/opam/.opam/default/lib/bin_prot/shape -I /home/opam/.opam/default/lib/core -I /home/opam/.opam/default/lib/core/base_for_tests -I /home/opam/.opam/default/lib/core/command -I /home/opam/.opam/default/lib/core/filename_base -I /home/opam/.opam/default/lib/core/heap_block -I /home/opam/.opam/default/lib/core/univ_map -I /home/opam/.opam/default/lib/core/validate -I /home/opam/.opam/default/lib/core_kernel -I /home/opam/.opam/default/lib/fieldslib -I /home/opam/.opam/default/lib/gel -I /home/opam/.opam/default/lib/int_repr -I /home/opam/.opam/default/lib/jane-street-headers -I /home/opam/.opam/default/lib/num -I /home/opam/.opam/default/lib/ocaml_intrinsics_kernel -I /home/opam/.opam/default/lib/parsexp -I /home/opam/.opam/default/lib/ppx_assert/runtime-lib -I /home/opam/.opam/default/lib/ppx_bench/runtime-lib -I /home/opam/.opam/default/lib/ppx_compare/runtime-lib -I /home/opam/.opam/default/lib/ppx_diff/diffable -I /home/opam/.opam/default/lib/ppx_diff/diffable_cinaps -I /home/opam/.opam/default/lib/ppx_enumerate/runtime-lib -I /home/opam/.opam/default/lib/ppx_expect/config -I /home/opam/.opam/default/lib/ppx_expect/config_types -I /home/opam/.opam/default/lib/ppx_expect/make_corrected_file -I /home/opam/.opam/default/lib/ppx_expect/runtime -I /home/opam/.opam/default/lib/ppx_hash/runtime-lib -I /home/opam/.opam/default/lib/ppx_here/runtime-lib -I /home/opam/.opam/default/lib/ppx_inline_test/config -I /home/opam/.opam/default/lib/ppx_inline_test/runtime-lib -I /home/opam/.opam/default/lib/ppx_log/syntax -I /home/opam/.opam/default/lib/ppx_log/types -I /home/opam/.opam/default/lib/ppx_module_timer/runtime -I /home/opam/.opam/default/lib/ppx_sexp_conv/runtime-lib -I /home/opam/.opam/default/lib/ppx_stable_witness/runtime -I /home/opam/.opam/default/lib/ppx_stable_witness/stable_witness -I /home/opam/.opam/default/lib/ppx_string/runtime -I /home/opam/.opam/default/lib/ppxlib/print_diff -I /home/opam/.opam/default/lib/sexplib -I /home/opam/.opam/default/lib/sexplib0 -I /home/opam/.opam/default/lib/splittable_random -I /home/opam/.opam/default/lib/stdio -I /home/opam/.opam/default/lib/time_now -I /home/opam/.opam/default/lib/typerep -I /home/opam/.opam/default/lib/variantslib -I /home/opam/.opam/default/lib/zarith -I /home/opam/.opam/default/lib/zarith_stubs_js -I lib/rand/.rand.objs/byte -I lib/rand/.rand.objs/native -cmi-file lib/.randoml.objs/byte/randoml.cmi -no-alias-deps -o lib/.randoml.objs/native/randoml.cmx -c -impl lib/randoml.pp.ml)
- File "lib/randoml.ml", line 1, characters 5-16:
- 1 | open Core_kernel
-          ^^^^^^^^^^^
- Alert deprecated: module Core_kernel
- [since 2021-05] Use [Core] -- [Core_kernel] was renamed as [Core]
- File "lib/rand/dune", lines 7-26, characters 0-671:
-  7 | (rule
-  8 |  (targets librand.a dllrand.so)
-  9 |  (deps
- ....
- 24 |     -c
- 25 |     "mv target/release/librand.so ./dllrand.so 2> /dev/null || mv target/release/librand.dylib ./dllrand.so 2> /dev/null || touch dllrand.so")
- 26 |    (run cp target/release/librand.a .))))
- (cd _build/default/lib/rand && /usr/bin/cargo build --release --offline)
-    Compiling proc-macro2 v1.0.27
-    Compiling libc v0.2.97
-    Compiling unicode-xid v0.2.2
-    Compiling cc v1.0.68
-    Compiling syn v1.0.73
-    Compiling ocaml-sys v0.20.1
-    Compiling cfg-if v1.0.0
-    Compiling cty v0.2.1
-    Compiling ocaml-boxroot-sys v0.2.0
-    Compiling ocaml-sys v0.22.0
-    Compiling quote v1.0.9
- warning: ocaml-boxroot-sys@0.2.0: vendor/boxroot/boxroot.c:23:10: fatal error: caml/compact.h: No such file or directory
- warning: ocaml-boxroot-sys@0.2.0:    23 | #include <caml/compact.h>
- warning: ocaml-boxroot-sys@0.2.0:       |          ^~~~~~~~~~~~~~~~
- warning: ocaml-boxroot-sys@0.2.0: compilation terminated.
- error: failed to run custom build command for `ocaml-boxroot-sys v0.2.0`
- 
- Caused by:
-   process didn't exit successfully: `/home/opam/.opam/default/.opam-switch/build/randoml.0.1.5/_build/default/lib/rand/target/release/build/ocaml-boxroot-sys-6f7441702399e165/build-script-build` (exit status: 1)
-   --- stdout
-   cargo:rerun-if-changed=vendor/boxroot/boxroot.c
-   cargo:rerun-if-changed=vendor/boxroot/boxroot.h
-   cargo:rerun-if-env-changed=OCAMLOPT
-   cargo:rerun-if-env-changed=OCAML_WHERE_PATH
-   TARGET = Some("x86_64-unknown-linux-gnu")
-   OPT_LEVEL = Some("3")
-   HOST = Some("x86_64-unknown-linux-gnu")
-   CC_x86_64-unknown-linux-gnu = None
-   CC_x86_64_unknown_linux_gnu = None
-   HOST_CC = None
-   CC = None
-   CFLAGS_x86_64-unknown-linux-gnu = None
-   CFLAGS_x86_64_unknown_linux_gnu = None
-   HOST_CFLAGS = None
-   CFLAGS = None
-   CRATE_CC_NO_DEFAULTS = None
-   DEBUG = Some("false")
-   CARGO_CFG_TARGET_FEATURE = Some("fxsr,sse,sse2")
-   running: "cc" "-O3" "-ffunction-sections" "-fdata-sections" "-fPIC" "-m64" "-I" "/home/opam/.opam/default/lib/ocaml" "-I" "vendor/boxroot/" "-Wall" "-Wextra" "-o" "/home/opam/.opam/default/.opam-switch/build/randoml.0.1.5/_build/default/lib/rand/target/release/build/ocaml-boxroot-sys-27e7b736356b61c0/out/vendor/boxroot/boxroot.o" "-c" "vendor/boxroot/boxroot.c"
-   cargo:warning=vendor/boxroot/boxroot.c:23:10: fatal error: caml/compact.h: No such file or directory
-   cargo:warning=   23 | #include <caml/compact.h>
-   cargo:warning=      |          ^~~~~~~~~~~~~~~~
-   cargo:warning=compilation terminated.
-   exit status: 1
- 
-   --- stderr
- 
- 
-   error occurred: Command "cc" "-O3" "-ffunction-sections" "-fdata-sections" "-fPIC" "-m64" "-I" "/home/opam/.opam/default/lib/ocaml" "-I" "vendor/boxroot/" "-Wall" "-Wextra" "-o" "/home/opam/.opam/default/.opam-switch/build/randoml.0.1.5/_build/default/lib/rand/target/release/build/ocaml-boxroot-sys-27e7b736356b61c0/out/vendor/boxroot/boxroot.o" "-c" "vendor/boxroot/boxroot.c" with args "cc" did not execute successfully (status code exit status: 1).
- 
- 
- warning: build failed, waiting for other jobs to finish...
[ERROR] The compilation of randoml.0.1.5 failed at "dune build -p randoml -j 39 @install".
build failed... 

=== STDERR ===

2026-10-25 02:13.26: FAILED: build randoml.0.1.5
2026-10-25 02:13.26: Job failed: build failed: randoml.0.1.5