Build:
  1. 0
2026-10-24 16:52.55: New job: build mysql8.1.0 (27e5256423c1)
2026-10-24 16:52.55: Waiting for resource in pool day11-builds
2026-10-24 17:27.50: Got resource from pool day11-builds
2026-10-24 17:27.50: [profile full] build mysql8.1.0
2026-10-24 17:27.50: build mysql8.1.0 (27e5256423c1)
=== DEPENDENCIES (32 transitive) ===
  base.v0.17.3                                       b1ff527613aa
  base-threads.base                                  ca51096a9c5b
  base-unix.base                                     88a83b7ed333
  compiler-cloning.enabled                           1aa529c962c5
  conf-mysql.1                                       97507c13afa5
  csexp.1.5.2                                        a054117ec731
  dune.3.24.2                                        6cd6abc0b8c5
  dune-configurator.3.24.2                           bd4df6cc6c29
  jane-street-headers.v0.17.0                        e79285e744ad
  jst-config.v0.17.0                                 f78069049fd4
  ocaml.5.5.2                                        3d66d99b0b38
  ocaml-base-compiler.5.5.2                          546a7f1026cd
  ocaml-compiler.5.5.2                               956e368db607
  ocaml-compiler-libs.v0.17.0                        5140a7724d3b
  ocaml_intrinsics_kernel.v0.17.3                    6750f7305423
  ppx_assert.v0.17.0                                 2b2db77b0d87
  ppx_base.v0.17.0                                   20e034b9fbc4
  ppx_cold.v0.17.0                                   261b0f80c6d2
  ppx_compare.v0.17.0                                6e659291557d
  ppx_derivers.1.2.1                                 c9a64fb6bb7b
  ppx_enumerate.v0.17.0                              e653471255d1
  ppx_globalize.v0.17.2                              843ce1ff3f3a
  ppx_hash.v0.17.0                                   d305db3c515d
  ppx_here.v0.17.0                                   2e177c680685
  ppx_inline_test.v0.17.1                            bbe143ce8aca
  ppx_optcomp.v0.17.1                                c04fb7c9788b
  ppx_sexp_conv.v0.17.1                              ccedb445c027
  ppxlib.0.39.0                                      4a1e195cb09b
  ppxlib_jane.v0.17.4                                d6c773a3be23
  sexplib0.v0.17.0                                   759f5d626115
  stdio.v0.17.0                                      6dd3d8d58b97
  time_now.v0.17.0                                   b33ac00874a1
=== STDOUT ===
Processing: [default: loading data]
[mysql8.1.0: dl]
[mysql8.1.0: extract]
-> retrieved mysql8.1.0  (https://opam.ocaml.org/cache)
[mysql8: dune build]
+ /home/opam/.opam/default/bin/dune "build" "-p" "mysql8" "-j" "39" (CWD=/home/opam/.opam/default/.opam-switch/build/mysql8.1.0)
- File "lib/dune", line 4, characters 10-22:
- 4 |  (c_names mysql8_stubs)
-               ^^^^^^^^^^^^
- (cd _build/default/lib && /usr/bin/gcc -O2 -fno-strict-aliasing -fwrapv -fPIC -pthread -D_FILE_OFFSET_BITS=64 -g -I /home/opam/.opam/default/lib/ocaml -I /home/opam/.opam/default/lib/base -I /home/opam/.opam/default/lib/base/base_internalhash_types -I /home/opam/.opam/default/lib/base/shadow_stdlib -I /home/opam/.opam/default/lib/jane-street-headers -I /home/opam/.opam/default/lib/ocaml_intrinsics_kernel -I /home/opam/.opam/default/lib/ppx_compare/runtime-lib -I /home/opam/.opam/default/lib/ppx_enumerate/runtime-lib -I /home/opam/.opam/default/lib/ppx_hash/runtime-lib -I /home/opam/.opam/default/lib/ppx_inline_test/config -I /home/opam/.opam/default/lib/ppx_inline_test/runtime-lib -I /home/opam/.opam/default/lib/ppx_sexp_conv/runtime-lib -I /home/opam/.opam/default/lib/sexplib0 -I /home/opam/.opam/default/lib/time_now -o mysql8_stubs.o -c mysql8_stubs.c)
- mysql8_stubs.c:38:10: fatal error: mysql.h: No such file or directory
-    38 | #include <mysql.h>
-       |          ^~~~~~~~~
- compilation terminated.
[ERROR] The compilation of mysql8.1.0 failed at "dune build -p mysql8 -j 39".
build failed... 

=== STDERR ===

2026-10-24 17:28.03: FAILED: build mysql8.1.0
2026-10-24 17:28.03: Job failed: build failed: mysql8.1.0