Build:
  1. 0
2026-10-24 15:59.43: New job: build salsa20.0.1.0 (3ad2fa08ba6f)
2026-10-24 15:59.43: Waiting for resource in pool day11-builds
2026-10-24 16:21.55: Got resource from pool day11-builds
2026-10-24 16:21.55: [profile full] build salsa20.0.1.0
2026-10-24 16:21.55: build salsa20.0.1.0 (3ad2fa08ba6f)
=== DEPENDENCIES (41 transitive) ===
  astring.0.8.5                                      cd1ffc8114c1
  base.v0.17.3                                       b1ff527613aa
  base-bytes.base                                    0447d5f52961
  base-threads.base                                  ca51096a9c5b
  base-unix.base                                     88a83b7ed333
  bigarray-compat.1.1.0                              8ae79dd0710d
  compiler-cloning.enabled                           1aa529c962c5
  conf-gmp.5                                         d0211a82c71f
  conf-pkg-config.5                                  26be2768a637
  cppo.1.8.0                                         a85675566f9f
  cpuid.0.1.2                                        33e43cadfcd4
  csexp.1.5.2                                        a054117ec731
  cstruct.6.0.0                                      f30551672788
  cstruct-lwt.6.0.0                                  b9d6046393a9
  dune.3.24.2                                        6cd6abc0b8c5
  dune-configurator.3.24.2                           bd4df6cc6c29
  lwt.5.10.1                                         2a01f416e386
  mirage-no-solo5.1                                  1387d6ab599f
  mirage-no-xen.1                                    6af51f299e17
  nocrypto.0.5.4-2                                   1b058c12a388
  num.1.6                                            bf79e8a7f25b
  ocaml.5.5.2                                        3d66d99b0b38
  ocaml-base-compiler.5.5.2                          546a7f1026cd
  ocaml-compiler.5.5.2                               956e368db607
  ocaml-compiler-libs.v0.17.0                        5140a7724d3b
  ocaml_intrinsics_kernel.v0.17.3                    6750f7305423
  ocamlbuild.0.16.1                                  2941453b8670
  ocamlfind.1.9.9~preview                            36cecca1627b
  ocb-stubblr.0.1.1-1                                14996e1e6819
  ocplib-endian.1.2                                  040ea05192b2
  parsexp.v0.17.0                                    82ae06473f31
  ppx_derivers.1.2.1                                 c9a64fb6bb7b
  ppx_deriving.6.2.0                                 cc4473bb884e
  ppx_sexp_conv.v0.17.1                              ccedb445c027
  ppxlib.0.39.0                                      4a1e195cb09b
  ppxlib_jane.v0.17.4                                d6c773a3be23
  salsa20-core.0.3.0                                 3b941f1c2768
  sexplib.v0.17.0                                    45a881bfc147
  sexplib0.v0.17.0                                   759f5d626115
  topkg.1.1.1                                        466156d28400
  zarith.1.14                                        cbecd38aadee
=== STDOUT ===
Processing: [default: loading data]
[salsa20.0.1.0: dl]
[salsa20.0.1.0: extract]
-> retrieved salsa20.0.1.0  (https://opam.ocaml.org/cache)
[salsa20: ocaml build]
+ /home/opam/.opam/default/bin/ocaml "pkg/pkg.ml" "build" "--pinned" "false" (CWD=/home/opam/.opam/default/.opam-switch/build/salsa20.0.1.0)
- + ocamlfind ocamlc -config
- + ocamlfind ocamldep -package 'salsa20-core, cstruct, nocrypto' -modules salsa20.ml > salsa20.ml.depends
- + ocamlfind ocamldep -package 'salsa20-core, cstruct, nocrypto' -modules salsa20.mli > salsa20.mli.depends
- + ocamlfind ocamlc -c -g -annot -bin-annot -package 'salsa20-core, cstruct, nocrypto' -w +A-4-6-7-9-40-42-44-48 -warn-error +1..49 -o salsa20.cmi salsa20.mli
- + ocamlfind ocamlopt -c -g -annot -bin-annot -package 'salsa20-core, cstruct, nocrypto' -w +A-4-6-7-9-40-42-44-48 -warn-error +1..49 -o salsa20.cmx salsa20.ml
- + ocamlfind ocamlopt -c -g -annot -bin-annot -package 'salsa20-core, cstruct, nocrypto' -w +A-4-6-7-9-40-42-44-48 -warn-error +1..49 -o salsa20.cmx salsa20.ml
- File "salsa20.ml", line 4, characters 2-22:
- 4 |   mutable state: Cs.t;
-       ^^^^^^^^^^^^^^^^^^^^
- Warning 69 [unused-field]: mutable record field state is never mutated.
- + ocamlfind ocamlopt -a salsa20.cmx -o salsa20.cmxa
- + ocamlfind ocamlc -c -g -annot -bin-annot -package 'salsa20-core, cstruct, nocrypto' -w +A-4-6-7-9-40-42-44-48 -warn-error +1..49 -o salsa20.cmo salsa20.ml
- + ocamlfind ocamlc -c -g -annot -bin-annot -package 'salsa20-core, cstruct, nocrypto' -w +A-4-6-7-9-40-42-44-48 -warn-error +1..49 -o salsa20.cmo salsa20.ml
- File "salsa20.ml", line 4, characters 2-22:
- 4 |   mutable state: Cs.t;
-       ^^^^^^^^^^^^^^^^^^^^
- Warning 69 [unused-field]: mutable record field state is never mutated.
- + ocamlfind ocamlopt -shared -linkall salsa20.cmxa -o salsa20.cmxs
- + ocamlfind ocamlc -a salsa20.cmo -o salsa20.cma
- Solver failed:
-   Ocamlbuild knows of no rules that apply to a target named ./salsa20.mly. This can happen if you ask Ocamlbuild to build a target with the wrong extension (e.g. .opt instead of .native) or if the source files live in directories that have not been specified as include directories.
- Backtrace:
-   - Failed to build the target pkg.otarget
-       - Building pkg.otarget:
-           - Building ./salsa20.ml:
-               - Failed to build all of these:
-                   - Building ./salsa20.mly
-                   - Building ./salsa20.mll
- pkg.ml: [ERROR] cmd ['ocamlbuild' '-use-ocamlfind' '-classic-display' '-j' '4' '-tag' 'debug'
-      '-build-dir' '_build' 'pkg.otarget']: exited with 6
[ERROR] The compilation of salsa20.0.1.0 failed at "ocaml pkg/pkg.ml build --pinned false".
build failed... 

=== STDERR ===

2026-10-24 16:22.20: FAILED: build salsa20.0.1.0
2026-10-24 16:22.20: Job failed: build failed: salsa20.0.1.0