Build:
- 0
2026-10-24 08:15.59: New job: build async_ssl.v0.15.0 (d89d074d0927)
2026-10-24 08:15.59: Waiting for resource in pool day11-builds
2026-10-24 09:11.21: Got resource from pool day11-builds
2026-10-24 09:11.21: [profile full] build async_ssl.v0.15.0
2026-10-24 09:11.22: build async_ssl.v0.15.0 (d89d074d0927)
=== DEPENDENCIES (88 transitive) ===
async.v0.15.0 5777a94e06ed
async_kernel.v0.15.0 db070e1fef91
async_rpc_kernel.v0.15.0 a8be8e0036ab
async_unix.v0.15.0 fef9bb5278f4
base.v0.15.2 cdfe26535095
base-threads.base ca51096a9c5b
base-unix.base 88a83b7ed333
base_bigstring.v0.15.0 b4d7fcf53e88
base_quickcheck.v0.15.0 8b1a5defc311
bin_prot.v0.15.0 607cb8134531
cmdliner.1.3.0 ee495648e7cd
conf-libffi.2.0.0 13818097de30
conf-libssl.4 9a6f007648db
conf-pkg-config.5 26be2768a637
core.v0.15.1 07d0fae89ffa
core_kernel.v0.15.0 af62eec3be5c
core_unix.v0.15.2 e11a8340a4a4
csexp.1.5.2 73bb7b0659d9
ctypes.0.24.0 06b583915030
ctypes-foreign.0.24.0 abde2dc67ba7
dune.3.24.2 859a21fcf334
dune-configurator.3.22.2 86c01a0c459f
expect_test_helpers_core.v0.15.0 86a730bb3fbe
fieldslib.v0.15.0 1eb8c574678d
int_repr.v0.15.0 616a8539ab43
integers.0.8.0 d9cfb5b065fb
jane-street-headers.v0.15.0 bdc7475e61fd
jst-config.v0.15.1 d113c89b8332
num.1.6 d765d796e3c8
ocaml.4.13.1 d824530970d2
ocaml-base-compiler.4.13.1 3bcdb3067e72
ocaml-compiler-libs.v0.12.4 2364b0354d70
ocaml-config.2 7b32a9542b55
ocaml-secondary-compiler.4.14.2 ad00659de5da
ocaml_intrinsics.v0.15.2 5e341c30d7b2
ocamlbuild.0.16.1 930921980f57
ocamlfind.1.9.6 f141e334ae42
ocamlfind-secondary.1.9.6 f8dc97ad8369
parsexp.v0.15.0 3ee75cb7b89d
ppx_assert.v0.15.0 dac094e7ac94
ppx_base.v0.15.0 7c63731fe6e8
ppx_bench.v0.15.1 579901c2e815
ppx_bin_prot.v0.15.0 668ddb37795c
ppx_cold.v0.15.0 cf4e8cfee216
ppx_compare.v0.15.0 1580b9ff1b97
ppx_custom_printf.v0.15.0 f90a2b762b6d
ppx_derivers.1.2.1 c4137bb9f672
ppx_disable_unused_warnings.v0.15.0 7c656de7a0e6
ppx_enumerate.v0.15.0 1afe08e1a982
ppx_expect.v0.15.1 64691c96c2c6
ppx_fields_conv.v0.15.0 7863af5319a8
ppx_fixed_literal.v0.15.0 b138d1ede67b
ppx_hash.v0.15.0 73031914fdfc
ppx_here.v0.15.0 fdd3496fd975
ppx_ignore_instrumentation.v0.15.0 fe3b8d496baf
ppx_inline_test.v0.15.1 945d595455f1
ppx_jane.v0.15.0 7d5d12c0a6c5
ppx_let.v0.15.0 5e4bad79938a
ppx_log.v0.15.0 9332671aa6b5
ppx_module_timer.v0.15.0 56e5c5ae9d46
ppx_optcomp.v0.15.0 ba799fb3ae63
ppx_optional.v0.15.0 e1f1bedc3492
ppx_pipebang.v0.15.0 0749f005a8ed
ppx_sexp_conv.v0.15.1 3cf2758cca21
ppx_sexp_message.v0.15.0 d52e4d2dbdf2
ppx_sexp_value.v0.15.0 fd078f5421a5
ppx_stable.v0.15.0 9542e3104e0a
ppx_string.v0.15.0 bd797a209dff
ppx_typerep_conv.v0.15.0 e65970eb5905
ppx_variants_conv.v0.15.0 1b777c33e98a
ppxlib.0.35.0 30a9a118731e
protocol_version_header.v0.15.0 7eb1d8011bd2
re.1.14.0 4279ad83aa88
sexp_pretty.v0.15.1 4bc283b5457f
sexplib.v0.15.1 458d9595bcf9
sexplib0.v0.15.1 53946840da56
spawn.v0.17.0 7e2a6dcddc99
splittable_random.v0.15.0 6cc219cf6826
stdio.v0.15.0 247d6c1cc305
stdlib-shims.0.3.0 b581b3e5357f
textutils.v0.15.0 a481d8bb8611
textutils_kernel.v0.15.0 17b26d097738
time_now.v0.15.0 9cb4c5d8ea19
timezone.v0.15.0 875f81c36736
topkg.1.1.1 40d4866f7edf
typerep.v0.15.0 3dac419a8f72
uutf.1.0.4 a232f692f4b1
variantslib.v0.15.0 b5a9b8c86eba
=== STDOUT ===
Processing: [default: loading data]
[async_ssl.v0.15.0: dl]
[async_ssl.v0.15.0: extract]
-> retrieved async_ssl.v0.15.0 (https://opam.ocaml.org/cache)
[async_ssl: dune build]
+ /home/opam/.opam/default/bin/dune "build" "-p" "async_ssl" "-j" "39" (CWD=/home/opam/.opam/default/.opam-switch/build/async_ssl.v0.15.0)
- (cd _build/default && /home/opam/.opam/default/bin/ocamlc.opt -w -40 -g -bin-annot -I bindings/.async_ssl_bindings.objs/byte -I /home/opam/.opam/default/lib/base -I /home/opam/.opam/default/lib/base/base_internalhash_types -I /home/opam/.opam/default/lib/base/caml -I /home/opam/.opam/default/lib/base/md5 -I /home/opam/.opam/default/lib/base/shadow_stdlib -I /home/opam/.opam/default/lib/base_quickcheck -I /home/opam/.opam/default/lib/base_quickcheck/ppx_quickcheck/runtime -I /home/opam/.opam/default/lib/bin_prot -I /home/opam/.opam/default/lib/bin_prot/shape -I /home/opam/.opam/default/lib/ctypes -I /home/opam/.opam/default/lib/ctypes-foreign -I /home/opam/.opam/default/lib/ctypes/stubs -I /home/opam/.opam/default/lib/fieldslib -I /home/opam/.opam/default/lib/integers -I /home/opam/.opam/default/lib/jane-street-headers -I /home/opam/.opam/default/lib/ocaml/threads -I /home/opam/.opam/default/lib/parsexp -I /home/opam/.opam/default/lib/ppx_assert/runtime-lib -I /home/opam/.opam/default/lib/ppx_bench/runtime-lib -I /home/opam/.opam/default/lib/ppx_compare/runtime-lib -I /home/opam/.opam/default/lib/ppx_enumerate/runtime-lib -I /home/opam/.opam/default/lib/ppx_expect/collector -I /home/opam/.opam/default/lib/ppx_expect/common -I /home/opam/.opam/default/lib/ppx_expect/config -I /home/opam/.opam/default/lib/ppx_expect/config_types -I /home/opam/.opam/default/lib/ppx_hash/runtime-lib -I /home/opam/.opam/default/lib/ppx_here/runtime-lib -I /home/opam/.opam/default/lib/ppx_inline_test/config -I /home/opam/.opam/default/lib/ppx_inline_test/runtime-lib -I /home/opam/.opam/default/lib/ppx_log/types -I /home/opam/.opam/default/lib/ppx_module_timer/runtime -I /home/opam/.opam/default/lib/ppx_sexp_conv/runtime-lib -I /home/opam/.opam/default/lib/sexplib -I /home/opam/.opam/default/lib/sexplib0 -I /home/opam/.opam/default/lib/splittable_random -I /home/opam/.opam/default/lib/stdio -I /home/opam/.opam/default/lib/stdlib-shims -I /home/opam/.opam/default/lib/time_now -I /home/opam/.opam/default/lib/typerep -I /home/opam/.opam/default/lib/variantslib -no-alias-deps -open Async_ssl_bindings -o bindings/.async_ssl_bindings.objs/byte/async_ssl_bindings__Ctypes_foreign_flat.cmo -c -impl bindings/ctypes_foreign_flat.pp.ml)
- File "bindings/ctypes_foreign_flat.ml", line 5, characters 39-68:
- 5 | module Ctypes_foreign_threaded_stubs = Ctypes_foreign_threaded_stubs
- ^^^^^^^^^^^^^^^^^^^^^^^^^^^^^
- Warning 49 [no-cmi-file]: no cmi file was found in path for module Ctypes_foreign_threaded_stubs
- (cd _build/default && /home/opam/.opam/default/bin/ocamlopt.opt -w -40 -g -I bindings/.async_ssl_bindings.objs/byte -I bindings/.async_ssl_bindings.objs/native -I /home/opam/.opam/default/lib/base -I /home/opam/.opam/default/lib/base/base_internalhash_types -I /home/opam/.opam/default/lib/base/caml -I /home/opam/.opam/default/lib/base/md5 -I /home/opam/.opam/default/lib/base/shadow_stdlib -I /home/opam/.opam/default/lib/base_quickcheck -I /home/opam/.opam/default/lib/base_quickcheck/ppx_quickcheck/runtime -I /home/opam/.opam/default/lib/bin_prot -I /home/opam/.opam/default/lib/bin_prot/shape -I /home/opam/.opam/default/lib/ctypes -I /home/opam/.opam/default/lib/ctypes-foreign -I /home/opam/.opam/default/lib/ctypes/stubs -I /home/opam/.opam/default/lib/fieldslib -I /home/opam/.opam/default/lib/integers -I /home/opam/.opam/default/lib/jane-street-headers -I /home/opam/.opam/default/lib/ocaml/threads -I /home/opam/.opam/default/lib/parsexp -I /home/opam/.opam/default/lib/ppx_assert/runtime-lib -I /home/opam/.opam/default/lib/ppx_bench/runtime-lib -I /home/opam/.opam/default/lib/ppx_compare/runtime-lib -I /home/opam/.opam/default/lib/ppx_enumerate/runtime-lib -I /home/opam/.opam/default/lib/ppx_expect/collector -I /home/opam/.opam/default/lib/ppx_expect/common -I /home/opam/.opam/default/lib/ppx_expect/config -I /home/opam/.opam/default/lib/ppx_expect/config_types -I /home/opam/.opam/default/lib/ppx_hash/runtime-lib -I /home/opam/.opam/default/lib/ppx_here/runtime-lib -I /home/opam/.opam/default/lib/ppx_inline_test/config -I /home/opam/.opam/default/lib/ppx_inline_test/runtime-lib -I /home/opam/.opam/default/lib/ppx_log/types -I /home/opam/.opam/default/lib/ppx_module_timer/runtime -I /home/opam/.opam/default/lib/ppx_sexp_conv/runtime-lib -I /home/opam/.opam/default/lib/sexplib -I /home/opam/.opam/default/lib/sexplib0 -I /home/opam/.opam/default/lib/splittable_random -I /home/opam/.opam/default/lib/stdio -I /home/opam/.opam/default/lib/stdlib-shims -I /home/opam/.opam/default/lib/time_now -I /home/opam/.opam/default/lib/typerep -I /home/opam/.opam/default/lib/variantslib -intf-suffix .ml -no-alias-deps -open Async_ssl_bindings -o bindings/.async_ssl_bindings.objs/native/async_ssl_bindings__Ctypes_foreign_flat.cmx -c -impl bindings/ctypes_foreign_flat.pp.ml)
- File "bindings/ctypes_foreign_flat.ml", line 5, characters 39-68:
- 5 | module Ctypes_foreign_threaded_stubs = Ctypes_foreign_threaded_stubs
- ^^^^^^^^^^^^^^^^^^^^^^^^^^^^^
- Warning 49 [no-cmi-file]: no cmi file was found in path for module Ctypes_foreign_threaded_stubs
- File "src/dune", line 16, characters 10-29:
- 16 | (c_names ffi_generated_stubs) (flags :standard -w -9-27-32-34)
- ^^^^^^^^^^^^^^^^^^^
- (cd _build/default/src && /usr/bin/gcc -O2 -fno-strict-aliasing -fwrapv -pthread -fPIC -D_FILE_OFFSET_BITS=64 -O2 -fno-strict-aliasing -fwrapv -pthread -fPIC -w -g -I /home/opam/.opam/default/lib/ocaml -I /home/opam/.opam/default/lib/async -I /home/opam/.opam/default/lib/async/async_command -I /home/opam/.opam/default/lib/async/async_quickcheck -I /home/opam/.opam/default/lib/async/async_rpc -I /home/opam/.opam/default/lib/async_kernel -I /home/opam/.opam/default/lib/async_kernel/config -I /home/opam/.opam/default/lib/async_kernel/persistent_connection_kernel -I /home/opam/.opam/default/lib/async_kernel/read_write_pair -I /home/opam/.opam/default/lib/async_rpc_kernel -I /home/opam/.opam/default/lib/async_unix -I /home/opam/.opam/default/lib/async_unix/thread_pool -I /home/opam/.opam/default/lib/async_unix/thread_safe_ivar -I /home/opam/.opam/default/lib/base -I /home/opam/.opam/default/lib/base/base_internalhash_types -I /home/opam/.opam/default/lib/base/caml -I /home/opam/.opam/default/lib/base/md5 -I /home/opam/.opam/default/lib/base/shadow_stdlib -I /home/opam/.opam/default/lib/base_bigstring -I /home/opam/.opam/default/lib/base_quickcheck -I /home/opam/.opam/default/lib/base_quickcheck/ppx_quickcheck/runtime -I /home/opam/.opam/default/lib/bin_prot -I /home/opam/.opam/default/lib/bin_prot/shape -I /home/opam/.opam/default/lib/core -I /home/opam/.opam/default/lib/core/base_for_tests -I /home/opam/.opam/default/lib/core/validate -I /home/opam/.opam/default/lib/core_kernel/bounded_int_table -I /home/opam/.opam/default/lib/core_kernel/caml_threads -I /home/opam/.opam/default/lib/core_kernel/caml_unix -I /home/opam/.opam/default/lib/core_kernel/flags -I /home/opam/.opam/default/lib/core_kernel/iobuf -I /home/opam/.opam/default/lib/core_kernel/moption -I /home/opam/.opam/default/lib/core_kernel/pairing_heap -I /home/opam/.opam/default/lib/core_kernel/sexp_hidden_in_test -I /home/opam/.opam/default/lib/core_kernel/thread_pool_cpu_affinity -I /home/opam/.opam/default/lib/core_kernel/thread_safe_queue -I /home/opam/.opam/default/lib/core_kernel/timing_wheel -I /home/opam/.opam/default/lib/core_kernel/tuple_pool -I /home/opam/.opam/default/lib/core_kernel/uopt -I /home/opam/.opam/default/lib/core_kernel/uuid -I /home/opam/.opam/default/lib/core_unix -I /home/opam/.opam/default/lib/core_unix/bigstring_unix -I /home/opam/.opam/default/lib/core_unix/core_thread -I /home/opam/.opam/default/lib/core_unix/error_checking_mutex -I /home/opam/.opam/default/lib/core_unix/filename_unix -I /home/opam/.opam/default/lib/core_unix/iobuf_unix -I /home/opam/.opam/default/lib/core_unix/linux_ext -I /home/opam/.opam/default/lib/core_unix/nano_mutex -I /home/opam/.opam/default/lib/core_unix/ocaml_c_utils -I /home/opam/.opam/default/lib/core_unix/signal_unix -I /home/opam/.opam/default/lib/core_unix/squeue -I /home/opam/.opam/default/lib/core_unix/sys_unix -I /home/opam/.opam/default/lib/core_unix/time_ns_unix -I /home/opam/.opam/default/lib/core_unix/time_stamp_counter -I /home/opam/.opam/default/lib/core_unix/time_unix -I /home/opam/.opam/default/lib/core_unix/uuid -I /home/opam/.opam/default/lib/ctypes -I /home/opam/.opam/default/lib/ctypes-foreign -I /home/opam/.opam/default/lib/ctypes/stubs -I /home/opam/.opam/default/lib/fieldslib -I /home/opam/.opam/default/lib/int_repr -I /home/opam/.opam/default/lib/integers -I /home/opam/.opam/default/lib/jane-street-headers -I /home/opam/.opam/default/lib/ocaml/threads -I /home/opam/.opam/default/lib/ocaml_intrinsics -I /home/opam/.opam/default/lib/parsexp -I /home/opam/.opam/default/lib/ppx_assert/runtime-lib -I /home/opam/.opam/default/lib/ppx_bench/runtime-lib -I /home/opam/.opam/default/lib/ppx_compare/runtime-lib -I /home/opam/.opam/default/lib/ppx_enumerate/runtime-lib -I /home/opam/.opam/default/lib/ppx_expect/collector -I /home/opam/.opam/default/lib/ppx_expect/common -I /home/opam/.opam/default/lib/ppx_expect/config -I /home/opam/.opam/default/lib/ppx_expect/config_types -I /home/opam/.opam/default/lib/ppx_hash/runtime-lib -I /home/opam/.opam/default/lib/ppx_here/runtime-lib -I /home/opam/.opam/default/lib/ppx_inline_test/config -I /home/opam/.opam/default/lib/ppx_inline_test/runtime-lib -I /home/opam/.opam/default/lib/ppx_log/types -I /home/opam/.opam/default/lib/ppx_module_timer/runtime -I /home/opam/.opam/default/lib/ppx_sexp_conv/runtime-lib -I /home/opam/.opam/default/lib/protocol_version_header -I /home/opam/.opam/default/lib/sexplib -I /home/opam/.opam/default/lib/sexplib/unix -I /home/opam/.opam/default/lib/sexplib0 -I /home/opam/.opam/default/lib/spawn -I /home/opam/.opam/default/lib/splittable_random -I /home/opam/.opam/default/lib/stdio -I /home/opam/.opam/default/lib/stdlib-shims -I /home/opam/.opam/default/lib/time_now -I /home/opam/.opam/default/lib/timezone -I /home/opam/.opam/default/lib/typerep -I /home/opam/.opam/default/lib/variantslib -I ../bindings -o ffi_generated_stubs.o -c ffi_generated_stubs.c)
- ffi_generated_stubs.c: In function 'async_ssl_stub_14_ENGINE_load_builtin_engines':
- ffi_generated_stubs.c:80:4: error: implicit declaration of function 'ENGINE_load_builtin_engines' [-Wimplicit-function-declaration]
- 80 | ENGINE_load_builtin_engines();
- | ^~~~~~~~~~~~~~~~~~~~~~~~~~~
- ffi_generated_stubs.c: In function 'async_ssl_stub_15_ENGINE_unregister_RAND':
- ffi_generated_stubs.c:85:4: error: implicit declaration of function 'ENGINE_unregister_RAND' [-Wimplicit-function-declaration]
- 85 | ENGINE_unregister_RAND();
- | ^~~~~~~~~~~~~~~~~~~~~~
- ffi_generated_stubs.c: In function 'async_ssl_stub_16_ENGINE_register_all_complete':
- ffi_generated_stubs.c:90:4: error: implicit declaration of function 'ENGINE_register_all_complete' [-Wimplicit-function-declaration]
- 90 | ENGINE_register_all_complete();
- | ^~~~~~~~~~~~~~~~~~~~~~~~~~~~
- ffi_generated_stubs.c: In function 'async_ssl_stub_50_BN_hex2bn':
- ffi_generated_stubs.c:315:25: error: passing argument 1 of 'BN_hex2bn' from incompatible pointer type [-Wincompatible-pointer-types]
- 315 | int x199 = BN_hex2bn(x197, x198);
- | ^~~~
- | |
- | void **
- In file included from /usr/include/openssl/params.h:16,
- from /usr/include/openssl/indicator.h:18,
- from /usr/include/openssl/core_dispatch.h:16,
- from /usr/include/openssl/evp.h:28,
- from /usr/include/openssl/x509.h:31,
- from /usr/include/openssl/ssl.h:34,
- from ffi_generated_stubs.c:2:
- /usr/include/openssl/bn.h:345:24: note: expected 'BIGNUM **' {aka 'struct bignum_st **'} but argument is of type 'void **'
- 345 | int BN_hex2bn(BIGNUM **a, const char *str);
- | ~~~~~~~~~^
- ffi_generated_stubs.c: In function 'async_ssl_stub_72_SSL_set_tmp_dh_callback':
- ffi_generated_stubs.c:467:34: error: passing argument 2 of 'SSL_set_tmp_dh_callback' from incompatible pointer type [-Wincompatible-pointer-types]
- 467 | SSL_set_tmp_dh_callback(x320, x321);
- | ^~~~
- | |
- | void * (*)(void *, _Bool, int)
- /usr/include/openssl/ssl.h:2282:11: note: expected 'DH * (*)(SSL *, int, int)' {aka 'struct dh_st * (*)(struct ssl_st *, int, int)'} but argument is of type 'void * (*)(void *, _Bool, int)'
- 2282 | DH *(*dh)(SSL *ssl, int is_export,
- | ~~~~~~^~~~~~~~~~~~~~~~~~~~~~~~~~~~
- 2283 | int keylength));
- | ~~~~~~~~~~~~~~
[ERROR] The compilation of async_ssl.v0.15.0 failed at "dune build -p async_ssl -j 39".
build failed...
=== STDERR ===
2026-10-24 09:12.35: FAILED: build async_ssl.v0.15.0
2026-10-24 09:12.35: Job failed: build failed: async_ssl.v0.15.0