Build:
  1. 0
2026-10-24 08:12.53: New job: build async_ssl.v0.15.0 (2836cfcf7f49)
2026-10-24 08:12.53: Waiting for resource in pool day11-builds
2026-10-24 09:11.16: Got resource from pool day11-builds
2026-10-24 09:11.16: [profile full] build async_ssl.v0.15.0
2026-10-24 09:11.16: build async_ssl.v0.15.0 (2836cfcf7f49)
=== DEPENDENCIES (86 transitive) ===
  async.v0.15.0                                      efda8150f597
  async_kernel.v0.15.0                               0d5ead9b75a2
  async_rpc_kernel.v0.15.0                           13222294863f
  async_unix.v0.15.0                                 d683ae29d664
  base.v0.15.2                                       a75e4ba6e430
  base-threads.base                                  ca51096a9c5b
  base-unix.base                                     88a83b7ed333
  base_bigstring.v0.15.0                             be99097b823c
  base_quickcheck.v0.15.0                            0f6717a085d4
  bin_prot.v0.15.0                                   62547ec07c17
  cmdliner.2.1.1                                     5cc6f61bac37
  conf-libffi.2.0.0                                  13818097de30
  conf-libssl.4                                      9a6f007648db
  conf-pkg-config.5                                  26be2768a637
  core.v0.15.1                                       66c74218aa94
  core_kernel.v0.15.0                                6f1e96ef490a
  core_unix.v0.15.2                                  488763775b10
  csexp.1.5.2                                        eadd699a5540
  ctypes.0.24.0                                      c5576576ea33
  ctypes-foreign.0.24.0                              0d2a43ec45f2
  dune.3.24.2                                        2f138705a519
  dune-configurator.3.24.2                           15f21e340e38
  expect_test_helpers_core.v0.15.0                   42a2eecf94eb
  fieldslib.v0.15.0                                  1c95cd8bae14
  int_repr.v0.15.0                                   3b0b523278f9
  integers.0.8.0                                     b3469dec1010
  jane-street-headers.v0.15.0                        ac6a5f5e38af
  jst-config.v0.15.1                                 04f795e5d77f
  num.1.6                                            080c82620e31
  ocaml.5.0.0                                        952750df80e8
  ocaml-base-compiler.5.0.0                          e696a2038b3f
  ocaml-compiler-libs.v0.12.4                        d93d314e997f
  ocaml-config.3                                     4d94cf046bcb
  ocaml_intrinsics.v0.15.2                           05b2c78406f5
  ocamlbuild.0.16.1                                  b22410b0ec6e
  ocamlfind.1.9.8                                    c7c236f982a5
  parsexp.v0.15.0                                    a976d0a1a0e4
  ppx_assert.v0.15.0                                 32d675e64975
  ppx_base.v0.15.0                                   b2dbd74ef1b0
  ppx_bench.v0.15.1                                  1a62ed256eee
  ppx_bin_prot.v0.15.0                               262a93e0db61
  ppx_cold.v0.15.0                                   2fee66ae761f
  ppx_compare.v0.15.0                                3d0640c501ff
  ppx_custom_printf.v0.15.0                          ff9695aa9137
  ppx_derivers.1.2.1                                 dc87a82c1c4c
  ppx_disable_unused_warnings.v0.15.0                130e19c15e75
  ppx_enumerate.v0.15.0                              440e7adf4261
  ppx_expect.v0.15.1                                 1d657b77ffc5
  ppx_fields_conv.v0.15.0                            ab85ab58358c
  ppx_fixed_literal.v0.15.0                          ac0f94a12c48
  ppx_hash.v0.15.0                                   f7247d5161e4
  ppx_here.v0.15.0                                   7973f88ee6e1
  ppx_ignore_instrumentation.v0.15.0                 b3e54a8e51b6
  ppx_inline_test.v0.15.1                            5ae77041cb24
  ppx_jane.v0.15.0                                   602cfae40617
  ppx_let.v0.15.0                                    48befdbf9dc8
  ppx_log.v0.15.0                                    51241a0fe494
  ppx_module_timer.v0.15.0                           33830c49bb3d
  ppx_optcomp.v0.15.0                                0669ef4025d7
  ppx_optional.v0.15.0                               3d9f1541dd76
  ppx_pipebang.v0.15.0                               832651988944
  ppx_sexp_conv.v0.15.1                              8670f5753836
  ppx_sexp_message.v0.15.0                           406eb5755420
  ppx_sexp_value.v0.15.0                             f19dc2dd900f
  ppx_stable.v0.15.0                                 9907dfd483d2
  ppx_string.v0.15.0                                 0340e788e0ae
  ppx_typerep_conv.v0.15.0                           e0a82a59d5f9
  ppx_variants_conv.v0.15.0                          1be3821206e8
  ppxlib.0.35.0                                      16a1ae165fc2
  protocol_version_header.v0.15.0                    bb6a00ea8512
  re.1.14.0                                          9d51a8178d73
  sexp_pretty.v0.15.1                                766190c53460
  sexplib.v0.15.1                                    b6332321ea34
  sexplib0.v0.15.1                                   246be6780286
  spawn.v0.17.0                                      815c43761195
  splittable_random.v0.15.0                          276a95034fb0
  stdio.v0.15.0                                      378b6258b9ed
  stdlib-shims.0.3.0                                 c1e37379d632
  textutils.v0.15.0                                  c049b8df7acb
  textutils_kernel.v0.15.0                           4cc3a0a82973
  time_now.v0.15.0                                   479f2d9fb8ed
  timezone.v0.15.0                                   9c0d0a3e6f77
  topkg.1.1.1                                        f11b6cbda4fe
  typerep.v0.15.0                                    7fdac7eed911
  uutf.1.0.4                                         fecd68529fbb
  variantslib.v0.15.0                                9e8a45cb7d41
=== STDOUT ===
Processing: [default: loading data]
[async_ssl.v0.15.0: dl]
[async_ssl.v0.15.0: extract]
-> retrieved async_ssl.v0.15.0  (https://opam.ocaml.org/cache)
[async_ssl: dune build]
+ /home/opam/.opam/default/bin/dune "build" "-p" "async_ssl" "-j" "39" (CWD=/home/opam/.opam/default/.opam-switch/build/async_ssl.v0.15.0)
- (cd _build/default && /home/opam/.opam/default/bin/ocamlc.opt -w -40 -g -bin-annot -I bindings/.async_ssl_bindings.objs/byte -I /home/opam/.opam/default/lib/base -I /home/opam/.opam/default/lib/base/base_internalhash_types -I /home/opam/.opam/default/lib/base/caml -I /home/opam/.opam/default/lib/base/md5 -I /home/opam/.opam/default/lib/base/shadow_stdlib -I /home/opam/.opam/default/lib/base_quickcheck -I /home/opam/.opam/default/lib/base_quickcheck/ppx_quickcheck/runtime -I /home/opam/.opam/default/lib/bin_prot -I /home/opam/.opam/default/lib/bin_prot/shape -I /home/opam/.opam/default/lib/ctypes -I /home/opam/.opam/default/lib/ctypes-foreign -I /home/opam/.opam/default/lib/ctypes/stubs -I /home/opam/.opam/default/lib/fieldslib -I /home/opam/.opam/default/lib/integers -I /home/opam/.opam/default/lib/jane-street-headers -I /home/opam/.opam/default/lib/ocaml/str -I /home/opam/.opam/default/lib/ocaml/threads -I /home/opam/.opam/default/lib/ocaml/unix -I /home/opam/.opam/default/lib/parsexp -I /home/opam/.opam/default/lib/ppx_assert/runtime-lib -I /home/opam/.opam/default/lib/ppx_bench/runtime-lib -I /home/opam/.opam/default/lib/ppx_compare/runtime-lib -I /home/opam/.opam/default/lib/ppx_enumerate/runtime-lib -I /home/opam/.opam/default/lib/ppx_expect/collector -I /home/opam/.opam/default/lib/ppx_expect/common -I /home/opam/.opam/default/lib/ppx_expect/config -I /home/opam/.opam/default/lib/ppx_expect/config_types -I /home/opam/.opam/default/lib/ppx_hash/runtime-lib -I /home/opam/.opam/default/lib/ppx_here/runtime-lib -I /home/opam/.opam/default/lib/ppx_inline_test/config -I /home/opam/.opam/default/lib/ppx_inline_test/runtime-lib -I /home/opam/.opam/default/lib/ppx_log/types -I /home/opam/.opam/default/lib/ppx_module_timer/runtime -I /home/opam/.opam/default/lib/ppx_sexp_conv/runtime-lib -I /home/opam/.opam/default/lib/sexplib -I /home/opam/.opam/default/lib/sexplib0 -I /home/opam/.opam/default/lib/splittable_random -I /home/opam/.opam/default/lib/stdio -I /home/opam/.opam/default/lib/stdlib-shims -I /home/opam/.opam/default/lib/time_now -I /home/opam/.opam/default/lib/typerep -I /home/opam/.opam/default/lib/variantslib -no-alias-deps -open Async_ssl_bindings -o bindings/.async_ssl_bindings.objs/byte/async_ssl_bindings__Ctypes_foreign_flat.cmo -c -impl bindings/ctypes_foreign_flat.pp.ml)
- File "bindings/ctypes_foreign_flat.ml", line 5, characters 39-68:
- 5 | module Ctypes_foreign_threaded_stubs = Ctypes_foreign_threaded_stubs
-                                            ^^^^^^^^^^^^^^^^^^^^^^^^^^^^^
- Warning 49 [no-cmi-file]: no cmi file was found in path for module Ctypes_foreign_threaded_stubs
- (cd _build/default && /home/opam/.opam/default/bin/ocamlopt.opt -w -40 -g -I bindings/.async_ssl_bindings.objs/byte -I bindings/.async_ssl_bindings.objs/native -I /home/opam/.opam/default/lib/base -I /home/opam/.opam/default/lib/base/base_internalhash_types -I /home/opam/.opam/default/lib/base/caml -I /home/opam/.opam/default/lib/base/md5 -I /home/opam/.opam/default/lib/base/shadow_stdlib -I /home/opam/.opam/default/lib/base_quickcheck -I /home/opam/.opam/default/lib/base_quickcheck/ppx_quickcheck/runtime -I /home/opam/.opam/default/lib/bin_prot -I /home/opam/.opam/default/lib/bin_prot/shape -I /home/opam/.opam/default/lib/ctypes -I /home/opam/.opam/default/lib/ctypes-foreign -I /home/opam/.opam/default/lib/ctypes/stubs -I /home/opam/.opam/default/lib/fieldslib -I /home/opam/.opam/default/lib/integers -I /home/opam/.opam/default/lib/jane-street-headers -I /home/opam/.opam/default/lib/ocaml/str -I /home/opam/.opam/default/lib/ocaml/threads -I /home/opam/.opam/default/lib/ocaml/unix -I /home/opam/.opam/default/lib/parsexp -I /home/opam/.opam/default/lib/ppx_assert/runtime-lib -I /home/opam/.opam/default/lib/ppx_bench/runtime-lib -I /home/opam/.opam/default/lib/ppx_compare/runtime-lib -I /home/opam/.opam/default/lib/ppx_enumerate/runtime-lib -I /home/opam/.opam/default/lib/ppx_expect/collector -I /home/opam/.opam/default/lib/ppx_expect/common -I /home/opam/.opam/default/lib/ppx_expect/config -I /home/opam/.opam/default/lib/ppx_expect/config_types -I /home/opam/.opam/default/lib/ppx_hash/runtime-lib -I /home/opam/.opam/default/lib/ppx_here/runtime-lib -I /home/opam/.opam/default/lib/ppx_inline_test/config -I /home/opam/.opam/default/lib/ppx_inline_test/runtime-lib -I /home/opam/.opam/default/lib/ppx_log/types -I /home/opam/.opam/default/lib/ppx_module_timer/runtime -I /home/opam/.opam/default/lib/ppx_sexp_conv/runtime-lib -I /home/opam/.opam/default/lib/sexplib -I /home/opam/.opam/default/lib/sexplib0 -I /home/opam/.opam/default/lib/splittable_random -I /home/opam/.opam/default/lib/stdio -I /home/opam/.opam/default/lib/stdlib-shims -I /home/opam/.opam/default/lib/time_now -I /home/opam/.opam/default/lib/typerep -I /home/opam/.opam/default/lib/variantslib -cmi-file bindings/.async_ssl_bindings.objs/byte/async_ssl_bindings__Ctypes_foreign_flat.cmi -no-alias-deps -open Async_ssl_bindings -o bindings/.async_ssl_bindings.objs/native/async_ssl_bindings__Ctypes_foreign_flat.cmx -c -impl bindings/ctypes_foreign_flat.pp.ml)
- File "bindings/ctypes_foreign_flat.ml", line 5, characters 39-68:
- 5 | module Ctypes_foreign_threaded_stubs = Ctypes_foreign_threaded_stubs
-                                            ^^^^^^^^^^^^^^^^^^^^^^^^^^^^^
- Warning 49 [no-cmi-file]: no cmi file was found in path for module Ctypes_foreign_threaded_stubs
- File "src/dune", line 16, characters 10-29:
- 16 |  (c_names ffi_generated_stubs) (flags :standard -w -9-27-32-34)
-                ^^^^^^^^^^^^^^^^^^^
- (cd _build/default/src && /usr/bin/gcc -O2 -fno-strict-aliasing -fwrapv -pthread -fPIC -D_FILE_OFFSET_BITS=64 -O2 -fno-strict-aliasing -fwrapv -pthread -fPIC -w -g -I /home/opam/.opam/default/lib/ocaml -I /home/opam/.opam/default/lib/async -I /home/opam/.opam/default/lib/async/async_command -I /home/opam/.opam/default/lib/async/async_quickcheck -I /home/opam/.opam/default/lib/async/async_rpc -I /home/opam/.opam/default/lib/async_kernel -I /home/opam/.opam/default/lib/async_kernel/config -I /home/opam/.opam/default/lib/async_kernel/persistent_connection_kernel -I /home/opam/.opam/default/lib/async_kernel/read_write_pair -I /home/opam/.opam/default/lib/async_rpc_kernel -I /home/opam/.opam/default/lib/async_unix -I /home/opam/.opam/default/lib/async_unix/thread_pool -I /home/opam/.opam/default/lib/async_unix/thread_safe_ivar -I /home/opam/.opam/default/lib/base -I /home/opam/.opam/default/lib/base/base_internalhash_types -I /home/opam/.opam/default/lib/base/caml -I /home/opam/.opam/default/lib/base/md5 -I /home/opam/.opam/default/lib/base/shadow_stdlib -I /home/opam/.opam/default/lib/base_bigstring -I /home/opam/.opam/default/lib/base_quickcheck -I /home/opam/.opam/default/lib/base_quickcheck/ppx_quickcheck/runtime -I /home/opam/.opam/default/lib/bin_prot -I /home/opam/.opam/default/lib/bin_prot/shape -I /home/opam/.opam/default/lib/core -I /home/opam/.opam/default/lib/core/base_for_tests -I /home/opam/.opam/default/lib/core/validate -I /home/opam/.opam/default/lib/core_kernel/bounded_int_table -I /home/opam/.opam/default/lib/core_kernel/caml_threads -I /home/opam/.opam/default/lib/core_kernel/caml_unix -I /home/opam/.opam/default/lib/core_kernel/flags -I /home/opam/.opam/default/lib/core_kernel/iobuf -I /home/opam/.opam/default/lib/core_kernel/moption -I /home/opam/.opam/default/lib/core_kernel/pairing_heap -I /home/opam/.opam/default/lib/core_kernel/sexp_hidden_in_test -I /home/opam/.opam/default/lib/core_kernel/thread_pool_cpu_affinity -I /home/opam/.opam/default/lib/core_kernel/thread_safe_queue -I /home/opam/.opam/default/lib/core_kernel/timing_wheel -I /home/opam/.opam/default/lib/core_kernel/tuple_pool -I /home/opam/.opam/default/lib/core_kernel/uopt -I /home/opam/.opam/default/lib/core_kernel/uuid -I /home/opam/.opam/default/lib/core_unix -I /home/opam/.opam/default/lib/core_unix/bigstring_unix -I /home/opam/.opam/default/lib/core_unix/core_thread -I /home/opam/.opam/default/lib/core_unix/error_checking_mutex -I /home/opam/.opam/default/lib/core_unix/filename_unix -I /home/opam/.opam/default/lib/core_unix/iobuf_unix -I /home/opam/.opam/default/lib/core_unix/linux_ext -I /home/opam/.opam/default/lib/core_unix/nano_mutex -I /home/opam/.opam/default/lib/core_unix/ocaml_c_utils -I /home/opam/.opam/default/lib/core_unix/signal_unix -I /home/opam/.opam/default/lib/core_unix/squeue -I /home/opam/.opam/default/lib/core_unix/sys_unix -I /home/opam/.opam/default/lib/core_unix/time_ns_unix -I /home/opam/.opam/default/lib/core_unix/time_stamp_counter -I /home/opam/.opam/default/lib/core_unix/time_unix -I /home/opam/.opam/default/lib/core_unix/uuid -I /home/opam/.opam/default/lib/ctypes -I /home/opam/.opam/default/lib/ctypes-foreign -I /home/opam/.opam/default/lib/ctypes/stubs -I /home/opam/.opam/default/lib/fieldslib -I /home/opam/.opam/default/lib/int_repr -I /home/opam/.opam/default/lib/integers -I /home/opam/.opam/default/lib/jane-street-headers -I /home/opam/.opam/default/lib/ocaml/str -I /home/opam/.opam/default/lib/ocaml/threads -I /home/opam/.opam/default/lib/ocaml/unix -I /home/opam/.opam/default/lib/ocaml_intrinsics -I /home/opam/.opam/default/lib/parsexp -I /home/opam/.opam/default/lib/ppx_assert/runtime-lib -I /home/opam/.opam/default/lib/ppx_bench/runtime-lib -I /home/opam/.opam/default/lib/ppx_compare/runtime-lib -I /home/opam/.opam/default/lib/ppx_enumerate/runtime-lib -I /home/opam/.opam/default/lib/ppx_expect/collector -I /home/opam/.opam/default/lib/ppx_expect/common -I /home/opam/.opam/default/lib/ppx_expect/config -I /home/opam/.opam/default/lib/ppx_expect/config_types -I /home/opam/.opam/default/lib/ppx_hash/runtime-lib -I /home/opam/.opam/default/lib/ppx_here/runtime-lib -I /home/opam/.opam/default/lib/ppx_inline_test/config -I /home/opam/.opam/default/lib/ppx_inline_test/runtime-lib -I /home/opam/.opam/default/lib/ppx_log/types -I /home/opam/.opam/default/lib/ppx_module_timer/runtime -I /home/opam/.opam/default/lib/ppx_sexp_conv/runtime-lib -I /home/opam/.opam/default/lib/protocol_version_header -I /home/opam/.opam/default/lib/sexplib -I /home/opam/.opam/default/lib/sexplib/unix -I /home/opam/.opam/default/lib/sexplib0 -I /home/opam/.opam/default/lib/spawn -I /home/opam/.opam/default/lib/splittable_random -I /home/opam/.opam/default/lib/stdio -I /home/opam/.opam/default/lib/stdlib-shims -I /home/opam/.opam/default/lib/time_now -I /home/opam/.opam/default/lib/timezone -I /home/opam/.opam/default/lib/typerep -I /home/opam/.opam/default/lib/variantslib -I ../bindings -o ffi_generated_stubs.o -c ffi_generated_stubs.c)
- ffi_generated_stubs.c: In function 'async_ssl_stub_14_ENGINE_load_builtin_engines':
- ffi_generated_stubs.c:80:4: error: implicit declaration of function 'ENGINE_load_builtin_engines' [-Wimplicit-function-declaration]
-    80 |    ENGINE_load_builtin_engines();
-       |    ^~~~~~~~~~~~~~~~~~~~~~~~~~~
- ffi_generated_stubs.c: In function 'async_ssl_stub_15_ENGINE_unregister_RAND':
- ffi_generated_stubs.c:85:4: error: implicit declaration of function 'ENGINE_unregister_RAND' [-Wimplicit-function-declaration]
-    85 |    ENGINE_unregister_RAND();
-       |    ^~~~~~~~~~~~~~~~~~~~~~
- ffi_generated_stubs.c: In function 'async_ssl_stub_16_ENGINE_register_all_complete':
- ffi_generated_stubs.c:90:4: error: implicit declaration of function 'ENGINE_register_all_complete' [-Wimplicit-function-declaration]
-    90 |    ENGINE_register_all_complete();
-       |    ^~~~~~~~~~~~~~~~~~~~~~~~~~~~
- ffi_generated_stubs.c: In function 'async_ssl_stub_50_BN_hex2bn':
- ffi_generated_stubs.c:315:25: error: passing argument 1 of 'BN_hex2bn' from incompatible pointer type [-Wincompatible-pointer-types]
-   315 |    int x199 = BN_hex2bn(x197, x198);
-       |                         ^~~~
-       |                         |
-       |                         void **
- In file included from /usr/include/openssl/params.h:16,
-                  from /usr/include/openssl/indicator.h:18,
-                  from /usr/include/openssl/core_dispatch.h:16,
-                  from /usr/include/openssl/evp.h:28,
-                  from /usr/include/openssl/x509.h:31,
-                  from /usr/include/openssl/ssl.h:34,
-                  from ffi_generated_stubs.c:2:
- /usr/include/openssl/bn.h:345:24: note: expected 'BIGNUM **' {aka 'struct bignum_st **'} but argument is of type 'void **'
-   345 | int BN_hex2bn(BIGNUM **a, const char *str);
-       |               ~~~~~~~~~^
- ffi_generated_stubs.c: In function 'async_ssl_stub_72_SSL_set_tmp_dh_callback':
- ffi_generated_stubs.c:467:34: error: passing argument 2 of 'SSL_set_tmp_dh_callback' from incompatible pointer type [-Wincompatible-pointer-types]
-   467 |    SSL_set_tmp_dh_callback(x320, x321);
-       |                                  ^~~~
-       |                                  |
-       |                                  void * (*)(void *, _Bool,  int)
- /usr/include/openssl/ssl.h:2282:11: note: expected 'DH * (*)(SSL *, int,  int)' {aka 'struct dh_st * (*)(struct ssl_st *, int,  int)'} but argument is of type 'void * (*)(void *, _Bool,  int)'
-  2282 |     DH *(*dh)(SSL *ssl, int is_export,
-       |     ~~~~~~^~~~~~~~~~~~~~~~~~~~~~~~~~~~
-  2283 |         int keylength));
-       |         ~~~~~~~~~~~~~~
[ERROR] The compilation of async_ssl.v0.15.0 failed at "dune build -p async_ssl -j 39".
build failed... 

=== STDERR ===

2026-10-24 09:12.01: FAILED: build async_ssl.v0.15.0
2026-10-24 09:12.01: Job failed: build failed: async_ssl.v0.15.0