Build:
- 0
2026-10-24 08:12.19: New job: build async_ssl.v0.16.0 (60c871a05811)
2026-10-24 08:12.19: Waiting for resource in pool day11-builds
2026-10-24 09:11.16: Got resource from pool day11-builds
2026-10-24 09:11.16: [profile full] build async_ssl.v0.16.0
2026-10-24 09:11.16: build async_ssl.v0.16.0 (60c871a05811)
=== DEPENDENCIES (88 transitive) ===
async.v0.16.0 102fa6af1597
async_kernel.v0.16.0 dd4745510e0a
async_rpc_kernel.v0.16.0 71fad07e9c70
async_unix.v0.16.0 869f41960894
base.v0.16.5 f59cb6d2f239
base-threads.base ca51096a9c5b
base-unix.base 88a83b7ed333
base_bigstring.v0.16.0 42493adb296c
base_quickcheck.v0.16.0 e28cbc353337
bin_prot.v0.16.0 f664de839706
conf-libffi.2.0.0 13818097de30
conf-libssl.4 9a6f007648db
conf-pkg-config.5 26be2768a637
core.v0.16.2 4d8d7009e589
core_kernel.v0.16.0 33c53605fc0a
core_unix.v0.16.0 2a9bd9aa83b8
csexp.1.5.2 cf66de86e9ce
ctypes.0.24.0 61c4f42d2e04
ctypes-foreign.0.24.0 69184c2ca3be
dune.3.24.2 7519a4549be9
dune-configurator.3.24.2 c3a8a7654795
expect_test_helpers_core.v0.16.0 88f23f6a3959
fieldslib.v0.16.0 242848feb081
int_repr.v0.16.0 dff3757f300e
integers.0.8.0 07a77f34903d
jane-street-headers.v0.16.0 7e56e52ba7ae
jst-config.v0.16.0 0936f8080c36
num.1.6 97708c819e4e
ocaml.5.2.1 2d686c4b1c5c
ocaml-base-compiler.5.2.1 d3ca04326b5c
ocaml-compiler-libs.v0.17.0 ddee96b6efe3
ocaml-config.3 661eb037103e
ocaml_intrinsics.v0.16.2 75c70d535429
ocamlbuild.0.16.1 dd32f9b47ee8
ocamlfind.1.9.8 073598b8b9bf
parsexp.v0.16.0 3030f34df148
ppx_assert.v0.16.0 7c83d0904df2
ppx_base.v0.16.0 740b037c84ac
ppx_bench.v0.16.0 8cd5b89b221c
ppx_bin_prot.v0.16.0 16403784ecb9
ppx_cold.v0.16.0 9f4d25858f27
ppx_compare.v0.16.0 dd78f719888e
ppx_custom_printf.v0.16.0 ed66fe00e5ce
ppx_derivers.1.2.1 6d121477b8a8
ppx_disable_unused_warnings.v0.16.0 a76b1ddee7e5
ppx_enumerate.v0.16.0 7b57c90e0960
ppx_expect.v0.16.2 d21cdaf6a996
ppx_fields_conv.v0.16.0 a98debe6d2d1
ppx_fixed_literal.v0.16.0 574f9cf7c1be
ppx_globalize.v0.16.0 25ff6ef51c29
ppx_hash.v0.16.0 24612c0fe1d8
ppx_here.v0.16.0 c42402cea2f1
ppx_ignore_instrumentation.v0.16.0 8a4ba5fa48d0
ppx_inline_test.v0.16.1 3b4b0f855ec8
ppx_jane.v0.16.0 236865bc4224
ppx_let.v0.16.0 b67922c2a056
ppx_log.v0.16.0 449ae1ce5cba
ppx_module_timer.v0.16.0 882732850bcb
ppx_optcomp.v0.16.0 766b60e0203c
ppx_optional.v0.16.0 faf29e0fcdb0
ppx_pipebang.v0.16.0 fb5a4501bcbd
ppx_sexp_conv.v0.16.0 4435c3487c72
ppx_sexp_message.v0.16.0 d6af11f398d6
ppx_sexp_value.v0.16.0 24e9eff22d12
ppx_stable.v0.16.0 93c0c3f7549c
ppx_stable_witness.v0.16.0 6c015a71e181
ppx_string.v0.16.0 7d14edd073ec
ppx_tydi.v0.16.0 0782b73ab013
ppx_typerep_conv.v0.16.0 5a4b0d96d395
ppx_variants_conv.v0.16.0 920e98b7e60c
ppxlib.0.35.0 b071d704570a
protocol_version_header.v0.16.0 970e7f16f178
re.1.14.0 db71d32844a9
sexp_pretty.v0.16.0 32b29a23b31f
sexplib.v0.16.0 80793f3e12a2
sexplib0.v0.16.0 e9d0b271b9e9
spawn.v0.17.0 8ab7f8002a56
splittable_random.v0.16.0 6e2ded55127c
stdio.v0.16.0 5b828f305f7b
stdlib-shims.0.3.0 c9f864280571
textutils.v0.16.0 66cef7aae371
textutils_kernel.v0.16.0 255a294c8284
time_now.v0.16.0 e6899812cb48
timezone.v0.16.0 ad1765cb97e0
topkg.1.1.1 df843f533bad
typerep.v0.16.0 82590e5e13ba
uutf.1.0.4 12df8379c845
variantslib.v0.16.0 a7081101d09b
=== STDOUT ===
Processing: [default: loading data]
[async_ssl.v0.16.0: dl]
[async_ssl.v0.16.0: extract]
-> retrieved async_ssl.v0.16.0 (https://opam.ocaml.org/cache)
[async_ssl: dune build]
+ /home/opam/.opam/default/bin/dune "build" "-p" "async_ssl" "-j" "39" (CWD=/home/opam/.opam/default/.opam-switch/build/async_ssl.v0.16.0)
- (cd _build/default && /home/opam/.opam/default/bin/ocamlc.opt -w -40 -g -bin-annot -bin-annot-occurrences -I bindings/.async_ssl_bindings.objs/byte -I /home/opam/.opam/default/lib/base -I /home/opam/.opam/default/lib/base/base_internalhash_types -I /home/opam/.opam/default/lib/base/caml -I /home/opam/.opam/default/lib/base/md5 -I /home/opam/.opam/default/lib/base/shadow_stdlib -I /home/opam/.opam/default/lib/base_quickcheck -I /home/opam/.opam/default/lib/base_quickcheck/ppx_quickcheck/runtime -I /home/opam/.opam/default/lib/bin_prot -I /home/opam/.opam/default/lib/bin_prot/shape -I /home/opam/.opam/default/lib/ctypes -I /home/opam/.opam/default/lib/ctypes-foreign -I /home/opam/.opam/default/lib/ctypes/stubs -I /home/opam/.opam/default/lib/fieldslib -I /home/opam/.opam/default/lib/integers -I /home/opam/.opam/default/lib/jane-street-headers -I /home/opam/.opam/default/lib/ocaml/str -I /home/opam/.opam/default/lib/ocaml/threads -I /home/opam/.opam/default/lib/ocaml/unix -I /home/opam/.opam/default/lib/parsexp -I /home/opam/.opam/default/lib/ppx_assert/runtime-lib -I /home/opam/.opam/default/lib/ppx_bench/runtime-lib -I /home/opam/.opam/default/lib/ppx_compare/runtime-lib -I /home/opam/.opam/default/lib/ppx_enumerate/runtime-lib -I /home/opam/.opam/default/lib/ppx_expect/collector -I /home/opam/.opam/default/lib/ppx_expect/common -I /home/opam/.opam/default/lib/ppx_expect/config -I /home/opam/.opam/default/lib/ppx_expect/config_types -I /home/opam/.opam/default/lib/ppx_hash/runtime-lib -I /home/opam/.opam/default/lib/ppx_here/runtime-lib -I /home/opam/.opam/default/lib/ppx_inline_test/config -I /home/opam/.opam/default/lib/ppx_inline_test/runtime-lib -I /home/opam/.opam/default/lib/ppx_log/types -I /home/opam/.opam/default/lib/ppx_module_timer/runtime -I /home/opam/.opam/default/lib/ppx_sexp_conv/runtime-lib -I /home/opam/.opam/default/lib/ppx_stable_witness/runtime -I /home/opam/.opam/default/lib/ppx_stable_witness/stable_witness -I /home/opam/.opam/default/lib/sexplib -I /home/opam/.opam/default/lib/sexplib0 -I /home/opam/.opam/default/lib/splittable_random -I /home/opam/.opam/default/lib/stdio -I /home/opam/.opam/default/lib/stdlib-shims -I /home/opam/.opam/default/lib/time_now -I /home/opam/.opam/default/lib/typerep -I /home/opam/.opam/default/lib/variantslib -no-alias-deps -open Async_ssl_bindings -o bindings/.async_ssl_bindings.objs/byte/async_ssl_bindings__Ctypes_foreign_flat.cmo -c -impl bindings/ctypes_foreign_flat.pp.ml)
- File "bindings/ctypes_foreign_flat.ml", line 5, characters 39-68:
- 5 | module Ctypes_foreign_threaded_stubs = Ctypes_foreign_threaded_stubs
- ^^^^^^^^^^^^^^^^^^^^^^^^^^^^^
- Warning 49 [no-cmi-file]: no cmi file was found in path for module Ctypes_foreign_threaded_stubs
- (cd _build/default && /home/opam/.opam/default/bin/ocamlopt.opt -w -40 -g -I bindings/.async_ssl_bindings.objs/byte -I bindings/.async_ssl_bindings.objs/native -I /home/opam/.opam/default/lib/base -I /home/opam/.opam/default/lib/base/base_internalhash_types -I /home/opam/.opam/default/lib/base/caml -I /home/opam/.opam/default/lib/base/md5 -I /home/opam/.opam/default/lib/base/shadow_stdlib -I /home/opam/.opam/default/lib/base_quickcheck -I /home/opam/.opam/default/lib/base_quickcheck/ppx_quickcheck/runtime -I /home/opam/.opam/default/lib/bin_prot -I /home/opam/.opam/default/lib/bin_prot/shape -I /home/opam/.opam/default/lib/ctypes -I /home/opam/.opam/default/lib/ctypes-foreign -I /home/opam/.opam/default/lib/ctypes/stubs -I /home/opam/.opam/default/lib/fieldslib -I /home/opam/.opam/default/lib/integers -I /home/opam/.opam/default/lib/jane-street-headers -I /home/opam/.opam/default/lib/ocaml/str -I /home/opam/.opam/default/lib/ocaml/threads -I /home/opam/.opam/default/lib/ocaml/unix -I /home/opam/.opam/default/lib/parsexp -I /home/opam/.opam/default/lib/ppx_assert/runtime-lib -I /home/opam/.opam/default/lib/ppx_bench/runtime-lib -I /home/opam/.opam/default/lib/ppx_compare/runtime-lib -I /home/opam/.opam/default/lib/ppx_enumerate/runtime-lib -I /home/opam/.opam/default/lib/ppx_expect/collector -I /home/opam/.opam/default/lib/ppx_expect/common -I /home/opam/.opam/default/lib/ppx_expect/config -I /home/opam/.opam/default/lib/ppx_expect/config_types -I /home/opam/.opam/default/lib/ppx_hash/runtime-lib -I /home/opam/.opam/default/lib/ppx_here/runtime-lib -I /home/opam/.opam/default/lib/ppx_inline_test/config -I /home/opam/.opam/default/lib/ppx_inline_test/runtime-lib -I /home/opam/.opam/default/lib/ppx_log/types -I /home/opam/.opam/default/lib/ppx_module_timer/runtime -I /home/opam/.opam/default/lib/ppx_sexp_conv/runtime-lib -I /home/opam/.opam/default/lib/ppx_stable_witness/runtime -I /home/opam/.opam/default/lib/ppx_stable_witness/stable_witness -I /home/opam/.opam/default/lib/sexplib -I /home/opam/.opam/default/lib/sexplib0 -I /home/opam/.opam/default/lib/splittable_random -I /home/opam/.opam/default/lib/stdio -I /home/opam/.opam/default/lib/stdlib-shims -I /home/opam/.opam/default/lib/time_now -I /home/opam/.opam/default/lib/typerep -I /home/opam/.opam/default/lib/variantslib -cmi-file bindings/.async_ssl_bindings.objs/byte/async_ssl_bindings__Ctypes_foreign_flat.cmi -no-alias-deps -open Async_ssl_bindings -o bindings/.async_ssl_bindings.objs/native/async_ssl_bindings__Ctypes_foreign_flat.cmx -c -impl bindings/ctypes_foreign_flat.pp.ml)
- File "bindings/ctypes_foreign_flat.ml", line 5, characters 39-68:
- 5 | module Ctypes_foreign_threaded_stubs = Ctypes_foreign_threaded_stubs
- ^^^^^^^^^^^^^^^^^^^^^^^^^^^^^
- Warning 49 [no-cmi-file]: no cmi file was found in path for module Ctypes_foreign_threaded_stubs
- File "src/dune", line 16, characters 10-29:
- 16 | (c_names ffi_generated_stubs) (flags :standard -w -9-27-32-34)
- ^^^^^^^^^^^^^^^^^^^
- (cd _build/default/src && /usr/bin/gcc -O2 -fno-strict-aliasing -fwrapv -pthread -fPIC -pthread -D_FILE_OFFSET_BITS=64 -O2 -fno-strict-aliasing -fwrapv -pthread -fPIC -pthread -w -g -I /home/opam/.opam/default/lib/ocaml -I /home/opam/.opam/default/lib/async -I /home/opam/.opam/default/lib/async/async_command -I /home/opam/.opam/default/lib/async/async_quickcheck -I /home/opam/.opam/default/lib/async/async_rpc -I /home/opam/.opam/default/lib/async_kernel -I /home/opam/.opam/default/lib/async_kernel/config -I /home/opam/.opam/default/lib/async_kernel/eager_deferred -I /home/opam/.opam/default/lib/async_kernel/persistent_connection_kernel -I /home/opam/.opam/default/lib/async_kernel/read_write_pair -I /home/opam/.opam/default/lib/async_rpc_kernel -I /home/opam/.opam/default/lib/async_unix -I /home/opam/.opam/default/lib/async_unix/thread_pool -I /home/opam/.opam/default/lib/async_unix/thread_safe_ivar -I /home/opam/.opam/default/lib/base -I /home/opam/.opam/default/lib/base/base_internalhash_types -I /home/opam/.opam/default/lib/base/caml -I /home/opam/.opam/default/lib/base/md5 -I /home/opam/.opam/default/lib/base/shadow_stdlib -I /home/opam/.opam/default/lib/base_bigstring -I /home/opam/.opam/default/lib/base_quickcheck -I /home/opam/.opam/default/lib/base_quickcheck/ppx_quickcheck/runtime -I /home/opam/.opam/default/lib/bin_prot -I /home/opam/.opam/default/lib/bin_prot/shape -I /home/opam/.opam/default/lib/core -I /home/opam/.opam/default/lib/core/base_for_tests -I /home/opam/.opam/default/lib/core/command -I /home/opam/.opam/default/lib/core/filename_base -I /home/opam/.opam/default/lib/core/heap_block -I /home/opam/.opam/default/lib/core/univ_map -I /home/opam/.opam/default/lib/core/validate -I /home/opam/.opam/default/lib/core_kernel/bounded_int_table -I /home/opam/.opam/default/lib/core_kernel/bus -I /home/opam/.opam/default/lib/core_kernel/caml_threads -I /home/opam/.opam/default/lib/core_kernel/caml_unix -I /home/opam/.opam/default/lib/core_kernel/flags -I /home/opam/.opam/default/lib/core_kernel/iobuf -I /home/opam/.opam/default/lib/core_kernel/moption -I /home/opam/.opam/default/lib/core_kernel/pairing_heap -I /home/opam/.opam/default/lib/core_kernel/sexp_hidden_in_test -I /home/opam/.opam/default/lib/core_kernel/thread_pool_cpu_affinity -I /home/opam/.opam/default/lib/core_kernel/thread_safe_queue -I /home/opam/.opam/default/lib/core_kernel/timing_wheel -I /home/opam/.opam/default/lib/core_kernel/tuple_pool -I /home/opam/.opam/default/lib/core_kernel/uopt -I /home/opam/.opam/default/lib/core_kernel/uuid -I /home/opam/.opam/default/lib/core_unix -I /home/opam/.opam/default/lib/core_unix/bigstring_unix -I /home/opam/.opam/default/lib/core_unix/core_thread -I /home/opam/.opam/default/lib/core_unix/error_checking_mutex -I /home/opam/.opam/default/lib/core_unix/filename_unix -I /home/opam/.opam/default/lib/core_unix/iobuf_unix -I /home/opam/.opam/default/lib/core_unix/linux_ext -I /home/opam/.opam/default/lib/core_unix/nano_mutex -I /home/opam/.opam/default/lib/core_unix/ocaml_c_utils -I /home/opam/.opam/default/lib/core_unix/signal_unix -I /home/opam/.opam/default/lib/core_unix/squeue -I /home/opam/.opam/default/lib/core_unix/sys_unix -I /home/opam/.opam/default/lib/core_unix/time_float_unix -I /home/opam/.opam/default/lib/core_unix/time_ns_unix -I /home/opam/.opam/default/lib/core_unix/time_stamp_counter -I /home/opam/.opam/default/lib/core_unix/uuid -I /home/opam/.opam/default/lib/ctypes -I /home/opam/.opam/default/lib/ctypes-foreign -I /home/opam/.opam/default/lib/ctypes/stubs -I /home/opam/.opam/default/lib/fieldslib -I /home/opam/.opam/default/lib/int_repr -I /home/opam/.opam/default/lib/integers -I /home/opam/.opam/default/lib/jane-street-headers -I /home/opam/.opam/default/lib/ocaml/str -I /home/opam/.opam/default/lib/ocaml/threads -I /home/opam/.opam/default/lib/ocaml/unix -I /home/opam/.opam/default/lib/ocaml_intrinsics -I /home/opam/.opam/default/lib/parsexp -I /home/opam/.opam/default/lib/ppx_assert/runtime-lib -I /home/opam/.opam/default/lib/ppx_bench/runtime-lib -I /home/opam/.opam/default/lib/ppx_compare/runtime-lib -I /home/opam/.opam/default/lib/ppx_enumerate/runtime-lib -I /home/opam/.opam/default/lib/ppx_expect/collector -I /home/opam/.opam/default/lib/ppx_expect/common -I /home/opam/.opam/default/lib/ppx_expect/config -I /home/opam/.opam/default/lib/ppx_expect/config_types -I /home/opam/.opam/default/lib/ppx_hash/runtime-lib -I /home/opam/.opam/default/lib/ppx_here/runtime-lib -I /home/opam/.opam/default/lib/ppx_inline_test/config -I /home/opam/.opam/default/lib/ppx_inline_test/runtime-lib -I /home/opam/.opam/default/lib/ppx_log/types -I /home/opam/.opam/default/lib/ppx_module_timer/runtime -I /home/opam/.opam/default/lib/ppx_sexp_conv/runtime-lib -I /home/opam/.opam/default/lib/ppx_stable_witness/runtime -I /home/opam/.opam/default/lib/ppx_stable_witness/stable_witness -I /home/opam/.opam/default/lib/protocol_version_header -I /home/opam/.opam/default/lib/sexplib -I /home/opam/.opam/default/lib/sexplib/unix -I /home/opam/.opam/default/lib/sexplib0 -I /home/opam/.opam/default/lib/spawn -I /home/opam/.opam/default/lib/splittable_random -I /home/opam/.opam/default/lib/stdio -I /home/opam/.opam/default/lib/stdlib-shims -I /home/opam/.opam/default/lib/time_now -I /home/opam/.opam/default/lib/timezone -I /home/opam/.opam/default/lib/typerep -I /home/opam/.opam/default/lib/variantslib -I ../bindings -o ffi_generated_stubs.o -c ffi_generated_stubs.c)
- ffi_generated_stubs.c: In function 'async_ssl_stub_14_ENGINE_load_builtin_engines':
- ffi_generated_stubs.c:80:4: error: implicit declaration of function 'ENGINE_load_builtin_engines' [-Wimplicit-function-declaration]
- 80 | ENGINE_load_builtin_engines();
- | ^~~~~~~~~~~~~~~~~~~~~~~~~~~
- ffi_generated_stubs.c: In function 'async_ssl_stub_15_ENGINE_unregister_RAND':
- ffi_generated_stubs.c:85:4: error: implicit declaration of function 'ENGINE_unregister_RAND' [-Wimplicit-function-declaration]
- 85 | ENGINE_unregister_RAND();
- | ^~~~~~~~~~~~~~~~~~~~~~
- ffi_generated_stubs.c: In function 'async_ssl_stub_16_ENGINE_register_all_complete':
- ffi_generated_stubs.c:90:4: error: implicit declaration of function 'ENGINE_register_all_complete' [-Wimplicit-function-declaration]
- 90 | ENGINE_register_all_complete();
- | ^~~~~~~~~~~~~~~~~~~~~~~~~~~~
- ffi_generated_stubs.c: In function 'async_ssl_stub_53_BN_hex2bn':
- ffi_generated_stubs.c:337:25: error: passing argument 1 of 'BN_hex2bn' from incompatible pointer type [-Wincompatible-pointer-types]
- 337 | int x217 = BN_hex2bn(x215, x216);
- | ^~~~
- | |
- | void **
- In file included from /usr/include/openssl/params.h:16,
- from /usr/include/openssl/indicator.h:18,
- from /usr/include/openssl/core_dispatch.h:16,
- from /usr/include/openssl/evp.h:28,
- from /usr/include/openssl/x509.h:31,
- from /usr/include/openssl/ssl.h:34,
- from ffi_generated_stubs.c:2:
- /usr/include/openssl/bn.h:345:24: note: expected 'BIGNUM **' {aka 'struct bignum_st **'} but argument is of type 'void **'
- 345 | int BN_hex2bn(BIGNUM **a, const char *str);
- | ~~~~~~~~~^
[ERROR] The compilation of async_ssl.v0.16.0 failed at "dune build -p async_ssl -j 39".
build failed...
=== STDERR ===
2026-10-24 09:12.01: FAILED: build async_ssl.v0.16.0
2026-10-24 09:12.01: Job failed: build failed: async_ssl.v0.16.0