Build:
  1. 0
2026-10-24 07:19.43: New job: build js_of_ocaml-webidl.0.1 (7444d0790e34)
2026-10-24 07:19.43: Waiting for resource in pool day11-builds
2026-10-24 08:12.17: Got resource from pool day11-builds
2026-10-24 08:12.17: [profile full] build js_of_ocaml-webidl.0.1
2026-10-24 08:12.17: build js_of_ocaml-webidl.0.1 (7444d0790e34)
=== DEPENDENCIES (90 transitive) ===
  async.v0.14.0                                      2da83654b09e
  async_kernel.v0.14.0                               0fb24a685ea5
  async_rpc_kernel.v0.14.0                           56ed6167ad32
  async_unix.v0.14.0                                 9e9bcad97f2f
  base.v0.14.4                                       22c97094dc3f
  base-bytes.base                                    9f260fabfcd1
  base-threads.base                                  ca51096a9c5b
  base-unix.base                                     88a83b7ed333
  base_bigstring.v0.14.0                             1ed5d7867ce3
  base_quickcheck.v0.14.1                            656b45b9c572
  bin_prot.v0.14.1                                   890fe71df4e8
  cmdliner.2.1.1                                     827e66fe97cd
  core.v0.14.1                                       c634cd21b857
  core_kernel.v0.14.2                                e107414e57c9
  cppo.1.8.0                                         0d84d748d2fa
  csexp.1.5.2                                        96ac127f6433
  dune.3.24.2                                        855550871648
  dune-configurator.3.24.2                           47eada71db2a
  fieldslib.v0.14.0                                  1864d4f60c78
  gen.1.1                                            4ace2be317a0
  jane-street-headers.v0.14.0                        fb81be5b831d
  js_of_ocaml.5.8.2                                  c7d23b071d6a
  js_of_ocaml-compiler.5.8.2                         8702a7673d3b
  js_of_ocaml-lwt.5.8.2                              a9d2117b9dca
  js_of_ocaml-ppx.5.8.2                              6fbf9da82008
  jst-config.v0.14.1                                 e10991d51ef1
  lwt.6.1.2                                          80f5e5623be8
  menhir.20211128                                    d29ccbca4f3b
  menhirLib.20211128                                 a8e22bc8429f
  menhirSdk.20211128                                 b9f6af0168b0
  num.1.6                                            2f4737d4ffb6
  ocaml.4.14.2                                       cbb67234c3a3
  ocaml-base-compiler.4.14.2                         832f26fb5f57
  ocaml-compiler-libs.v0.12.4                        b5b595dd7140
  ocaml-config.2                                     d03d16395a3f
  ocamlbuild.0.16.1                                  bf0e0ec4d646
  ocamlfind.1.9.8                                    f6cdbdc32ca2
  ocplib-endian.1.2                                  9a641bbe0fb0
  octavius.1.2.2                                     8837f8bcc8c5
  parsexp.v0.14.2                                    dcb9dc386801
  ppx_assert.v0.14.0                                 e54d8c63abe3
  ppx_base.v0.14.0                                   421ea33f66d2
  ppx_bench.v0.14.1                                  8b9d486118ac
  ppx_bin_prot.v0.14.0                               59f1d662bd53
  ppx_cold.v0.14.0                                   4755dd046cec
  ppx_compare.v0.14.0                                f88c44304caa
  ppx_custom_printf.v0.14.1                          30aee9546fe2
  ppx_derivers.1.2.1                                 b59fce150bbd
  ppx_deriving.5.2.1                                 6ff5cd16946c
  ppx_enumerate.v0.14.0                              f707bf886ed1
  ppx_expect.v0.14.2                                 f77850a07d6a
  ppx_fields_conv.v0.14.2                            92538d3e9086
  ppx_fixed_literal.v0.14.0                          d9b2f1e37384
  ppx_hash.v0.14.0                                   de09fc1d63a7
  ppx_here.v0.14.0                                   c6fd5d26ab30
  ppx_inline_test.v0.14.1                            0fd16e502519
  ppx_jane.v0.14.0                                   24593ee58be8
  ppx_js_style.v0.14.1                               789e55c46442
  ppx_let.v0.14.0                                    12287e6e1f88
  ppx_module_timer.v0.14.0                           7e098c7f840a
  ppx_optcomp.v0.14.3                                efbde0bb804e
  ppx_optional.v0.14.0                               31df47847715
  ppx_pipebang.v0.14.0                               7091c91adc8e
  ppx_sexp_conv.v0.14.3                              f4fc68adcb1b
  ppx_sexp_message.v0.14.1                           754de0999946
  ppx_sexp_value.v0.14.0                             b505ffdebd4a
  ppx_stable.v0.14.1                                 8aabd49660ae
  ppx_string.v0.14.1                                 b1d832c40c4c
  ppx_typerep_conv.v0.14.2                           9d0c10c6ad6b
  ppx_variants_conv.v0.14.2                          a778e47d27e9
  ppxlib.0.25.1                                      8f242021d188
  protocol_version_header.v0.14.0                    ec0c78cafa69
  re.1.14.0                                          025ebebcb6e1
  result.1.5                                         3698a2860c1e
  sedlex.2.5                                         2a66c40bdad6
  seq.base                                           186bc9f7d9c3
  sexplib.v0.14.0                                    a7a4aba76f1a
  sexplib0.v0.14.0                                   864f3c90754c
  spawn.v0.17.0                                      5bb729cee70f
  splittable_random.v0.14.0                          2912e47069e4
  stdio.v0.14.0                                      6105d40fa686
  stdlib-shims.0.3.0                                 2286699790f8
  textutils.v0.14.0                                  976c91fc9a1e
  time_now.v0.14.0                                   f59e6127e3da
  timezone.v0.14.0                                   703a9d4015e9
  typerep.v0.14.0                                    1e9f271278d0
  uchar.0.0.2                                        cd9b83de81bd
  variantslib.v0.14.0                                809dea10f72a
  webidl.1.4                                         c7f108662f73
  yojson.3.0.0                                       fb3070b8ddf7
=== STDOUT ===
Processing: [default: loading data]
[js_of_ocaml-webidl.0.1: dl]
[js_of_ocaml-webidl.0.1: extract]
-> retrieved js_of_ocaml-webidl.0.1  (https://opam.ocaml.org/cache)
[js_of_ocaml-webidl: dune build]
+ /home/opam/.opam/default/bin/dune "build" "-p" "js_of_ocaml-webidl" "-j" "39" "@install" (CWD=/home/opam/.opam/default/.opam-switch/build/js_of_ocaml-webidl.0.1)
- (cd _build/default && /home/opam/.opam/default/bin/menhir --unused-tokens --external-tokens Tokens webidl/src/syntax/non_standard.mly webidl/src/syntax/parser.mly webidl/src/syntax/parser_custom_ext.mly webidl/src/syntax/tokens.mly --base webidl/src/syntax/parser --infer-write-query webidl/src/syntax/parser__mock.ml.mock)
- File "webidl/src/syntax/non_standard.mly", line 29, characters 8-30:
- Warning: symbol attributeSerializetion is unreachable from any of the start symbol(s).
- File "webidl/src/syntax/parser.mly", line 242, characters 8-19:
- Warning: symbol identifiers is unreachable from any of the start symbol(s).
- (cd _build/default && /home/opam/.opam/default/bin/menhir --unused-tokens --external-tokens Tokens webidl/src/syntax/non_standard.mly webidl/src/syntax/parser.mly webidl/src/syntax/parser_basic_ext.mly webidl/src/syntax/tokens.mly --base webidl/src/syntax/parser_extend --infer-write-query webidl/src/syntax/parser_extend__mock.ml.mock)
- File "webidl/src/syntax/non_standard.mly", line 29, characters 8-30:
- Warning: symbol attributeSerializetion is unreachable from any of the start symbol(s).
- File "webidl/src/syntax/non_standard.mly", line 32, characters 8-17:
- Warning: symbol commnaEnd is unreachable from any of the start symbol(s).
- File "webidl/src/syntax/non_standard.mly", line 35, characters 8-34:
- Warning: symbol emptyExtendedAttributeList is unreachable from any of the start symbol(s).
- (cd _build/default && /home/opam/.opam/default/bin/ocamlc.opt -w -40 -w +a-4-40-41-42-44-45-48-33 -g -bin-annot -I webidl/src/syntax/.webidl_syntax.objs/byte -I /home/opam/.opam/default/lib/base -I /home/opam/.opam/default/lib/base/base_internalhash_types -I /home/opam/.opam/default/lib/base/caml -I /home/opam/.opam/default/lib/base/md5 -I /home/opam/.opam/default/lib/base/shadow_stdlib -I /home/opam/.opam/default/lib/base_bigstring -I /home/opam/.opam/default/lib/base_quickcheck -I /home/opam/.opam/default/lib/bin_prot -I /home/opam/.opam/default/lib/bin_prot/shape -I /home/opam/.opam/default/lib/core -I /home/opam/.opam/default/lib/core/error_checking_mutex -I /home/opam/.opam/default/lib/core_kernel -I /home/opam/.opam/default/lib/core_kernel/base_for_tests -I /home/opam/.opam/default/lib/core_kernel/caml_unix -I /home/opam/.opam/default/lib/core_kernel/flags -I /home/opam/.opam/default/lib/core_kernel/version_util -I /home/opam/.opam/default/lib/fieldslib -I /home/opam/.opam/default/lib/jane-street-headers -I /home/opam/.opam/default/lib/ocaml/threads -I /home/opam/.opam/default/lib/parsexp -I /home/opam/.opam/default/lib/ppx_assert/runtime-lib -I /home/opam/.opam/default/lib/ppx_bench/runtime-lib -I /home/opam/.opam/default/lib/ppx_compare/runtime-lib -I /home/opam/.opam/default/lib/ppx_enumerate/runtime-lib -I /home/opam/.opam/default/lib/ppx_expect/collector -I /home/opam/.opam/default/lib/ppx_expect/common -I /home/opam/.opam/default/lib/ppx_expect/config -I /home/opam/.opam/default/lib/ppx_expect/config_types -I /home/opam/.opam/default/lib/ppx_hash/runtime-lib -I /home/opam/.opam/default/lib/ppx_here/runtime-lib -I /home/opam/.opam/default/lib/ppx_inline_test/config -I /home/opam/.opam/default/lib/ppx_inline_test/runtime-lib -I /home/opam/.opam/default/lib/ppx_module_timer/runtime -I /home/opam/.opam/default/lib/ppx_sexp_conv/runtime-lib -I /home/opam/.opam/default/lib/sexplib -I /home/opam/.opam/default/lib/sexplib/unix -I /home/opam/.opam/default/lib/sexplib0 -I /home/opam/.opam/default/lib/spawn -I /home/opam/.opam/default/lib/splittable_random -I /home/opam/.opam/default/lib/stdio -I /home/opam/.opam/default/lib/time_now -I /home/opam/.opam/default/lib/timezone -I /home/opam/.opam/default/lib/typerep -I /home/opam/.opam/default/lib/variantslib -no-alias-deps -open Webidl_syntax -o webidl/src/syntax/.webidl_syntax.objs/byte/webidl_syntax__Keyword.cmo -c -impl webidl/src/syntax/keyword.pp.ml)
- File "webidl/src/syntax/keyword.pp.ml", line 1:
- Warning 70 [missing-mli]: Cannot find interface file.
- (cd _build/default && /home/opam/.opam/default/bin/ocamlc.opt -w -40 -w +a-4-40-41-42-44-45-48-33 -g -bin-annot -I webidl/src/syntax/.webidl_syntax.objs/byte -I /home/opam/.opam/default/lib/base -I /home/opam/.opam/default/lib/base/base_internalhash_types -I /home/opam/.opam/default/lib/base/caml -I /home/opam/.opam/default/lib/base/md5 -I /home/opam/.opam/default/lib/base/shadow_stdlib -I /home/opam/.opam/default/lib/base_bigstring -I /home/opam/.opam/default/lib/base_quickcheck -I /home/opam/.opam/default/lib/bin_prot -I /home/opam/.opam/default/lib/bin_prot/shape -I /home/opam/.opam/default/lib/core -I /home/opam/.opam/default/lib/core/error_checking_mutex -I /home/opam/.opam/default/lib/core_kernel -I /home/opam/.opam/default/lib/core_kernel/base_for_tests -I /home/opam/.opam/default/lib/core_kernel/caml_unix -I /home/opam/.opam/default/lib/core_kernel/flags -I /home/opam/.opam/default/lib/core_kernel/version_util -I /home/opam/.opam/default/lib/fieldslib -I /home/opam/.opam/default/lib/jane-street-headers -I /home/opam/.opam/default/lib/ocaml/threads -I /home/opam/.opam/default/lib/parsexp -I /home/opam/.opam/default/lib/ppx_assert/runtime-lib -I /home/opam/.opam/default/lib/ppx_bench/runtime-lib -I /home/opam/.opam/default/lib/ppx_compare/runtime-lib -I /home/opam/.opam/default/lib/ppx_enumerate/runtime-lib -I /home/opam/.opam/default/lib/ppx_expect/collector -I /home/opam/.opam/default/lib/ppx_expect/common -I /home/opam/.opam/default/lib/ppx_expect/config -I /home/opam/.opam/default/lib/ppx_expect/config_types -I /home/opam/.opam/default/lib/ppx_hash/runtime-lib -I /home/opam/.opam/default/lib/ppx_here/runtime-lib -I /home/opam/.opam/default/lib/ppx_inline_test/config -I /home/opam/.opam/default/lib/ppx_inline_test/runtime-lib -I /home/opam/.opam/default/lib/ppx_module_timer/runtime -I /home/opam/.opam/default/lib/ppx_sexp_conv/runtime-lib -I /home/opam/.opam/default/lib/sexplib -I /home/opam/.opam/default/lib/sexplib/unix -I /home/opam/.opam/default/lib/sexplib0 -I /home/opam/.opam/default/lib/spawn -I /home/opam/.opam/default/lib/splittable_random -I /home/opam/.opam/default/lib/stdio -I /home/opam/.opam/default/lib/time_now -I /home/opam/.opam/default/lib/timezone -I /home/opam/.opam/default/lib/typerep -I /home/opam/.opam/default/lib/variantslib -no-alias-deps -open Webidl_syntax -o webidl/src/syntax/.webidl_syntax.objs/byte/webidl_syntax__Ast.cmo -c -impl webidl/src/syntax/ast.pp.ml)
- File "webidl/src/syntax/ast.pp.ml", line 1:
- Warning 70 [missing-mli]: Cannot find interface file.
- (cd _build/default && /home/opam/.opam/default/bin/ocamlc.opt -w -40 -w +a-4-40-41-42-44-45-48-33 -g -bin-annot -I webidl/src/syntax/.webidl_syntax.objs/byte -I /home/opam/.opam/default/lib/base -I /home/opam/.opam/default/lib/base/base_internalhash_types -I /home/opam/.opam/default/lib/base/caml -I /home/opam/.opam/default/lib/base/md5 -I /home/opam/.opam/default/lib/base/shadow_stdlib -I /home/opam/.opam/default/lib/base_bigstring -I /home/opam/.opam/default/lib/base_quickcheck -I /home/opam/.opam/default/lib/bin_prot -I /home/opam/.opam/default/lib/bin_prot/shape -I /home/opam/.opam/default/lib/core -I /home/opam/.opam/default/lib/core/error_checking_mutex -I /home/opam/.opam/default/lib/core_kernel -I /home/opam/.opam/default/lib/core_kernel/base_for_tests -I /home/opam/.opam/default/lib/core_kernel/caml_unix -I /home/opam/.opam/default/lib/core_kernel/flags -I /home/opam/.opam/default/lib/core_kernel/version_util -I /home/opam/.opam/default/lib/fieldslib -I /home/opam/.opam/default/lib/jane-street-headers -I /home/opam/.opam/default/lib/ocaml/threads -I /home/opam/.opam/default/lib/parsexp -I /home/opam/.opam/default/lib/ppx_assert/runtime-lib -I /home/opam/.opam/default/lib/ppx_bench/runtime-lib -I /home/opam/.opam/default/lib/ppx_compare/runtime-lib -I /home/opam/.opam/default/lib/ppx_enumerate/runtime-lib -I /home/opam/.opam/default/lib/ppx_expect/collector -I /home/opam/.opam/default/lib/ppx_expect/common -I /home/opam/.opam/default/lib/ppx_expect/config -I /home/opam/.opam/default/lib/ppx_expect/config_types -I /home/opam/.opam/default/lib/ppx_hash/runtime-lib -I /home/opam/.opam/default/lib/ppx_here/runtime-lib -I /home/opam/.opam/default/lib/ppx_inline_test/config -I /home/opam/.opam/default/lib/ppx_inline_test/runtime-lib -I /home/opam/.opam/default/lib/ppx_module_timer/runtime -I /home/opam/.opam/default/lib/ppx_sexp_conv/runtime-lib -I /home/opam/.opam/default/lib/sexplib -I /home/opam/.opam/default/lib/sexplib/unix -I /home/opam/.opam/default/lib/sexplib0 -I /home/opam/.opam/default/lib/spawn -I /home/opam/.opam/default/lib/splittable_random -I /home/opam/.opam/default/lib/stdio -I /home/opam/.opam/default/lib/time_now -I /home/opam/.opam/default/lib/timezone -I /home/opam/.opam/default/lib/typerep -I /home/opam/.opam/default/lib/variantslib -no-alias-deps -open Webidl_syntax -o webidl/src/syntax/.webidl_syntax.objs/byte/webidl_syntax__Parser.cmi -c -intf webidl/src/syntax/parser.pp.mli)
- File "webidl/src/syntax/parser.mli", line 3, characters 11-16:
- 3 |           (Param : sig
-                ^^^^^
- Warning 67 [unused-functor-parameter]: unused functor parameter Param.
- File "webidl/src/syntax/parser.mli", line 6, characters 11-25:
- 6 |           (Parse_extended : sig
-                ^^^^^^^^^^^^^^
- Warning 67 [unused-functor-parameter]: unused functor parameter Parse_extended.
- (cd _build/default && /home/opam/.opam/default/bin/ocamlc.opt -w -40 -w +a-4-40-41-42-44-45-48-33 -g -bin-annot -I webidl/src/syntax/.webidl_syntax.objs/byte -I /home/opam/.opam/default/lib/base -I /home/opam/.opam/default/lib/base/base_internalhash_types -I /home/opam/.opam/default/lib/base/caml -I /home/opam/.opam/default/lib/base/md5 -I /home/opam/.opam/default/lib/base/shadow_stdlib -I /home/opam/.opam/default/lib/base_bigstring -I /home/opam/.opam/default/lib/base_quickcheck -I /home/opam/.opam/default/lib/bin_prot -I /home/opam/.opam/default/lib/bin_prot/shape -I /home/opam/.opam/default/lib/core -I /home/opam/.opam/default/lib/core/error_checking_mutex -I /home/opam/.opam/default/lib/core_kernel -I /home/opam/.opam/default/lib/core_kernel/base_for_tests -I /home/opam/.opam/default/lib/core_kernel/caml_unix -I /home/opam/.opam/default/lib/core_kernel/flags -I /home/opam/.opam/default/lib/core_kernel/version_util -I /home/opam/.opam/default/lib/fieldslib -I /home/opam/.opam/default/lib/jane-street-headers -I /home/opam/.opam/default/lib/ocaml/threads -I /home/opam/.opam/default/lib/parsexp -I /home/opam/.opam/default/lib/ppx_assert/runtime-lib -I /home/opam/.opam/default/lib/ppx_bench/runtime-lib -I /home/opam/.opam/default/lib/ppx_compare/runtime-lib -I /home/opam/.opam/default/lib/ppx_enumerate/runtime-lib -I /home/opam/.opam/default/lib/ppx_expect/collector -I /home/opam/.opam/default/lib/ppx_expect/common -I /home/opam/.opam/default/lib/ppx_expect/config -I /home/opam/.opam/default/lib/ppx_expect/config_types -I /home/opam/.opam/default/lib/ppx_hash/runtime-lib -I /home/opam/.opam/default/lib/ppx_here/runtime-lib -I /home/opam/.opam/default/lib/ppx_inline_test/config -I /home/opam/.opam/default/lib/ppx_inline_test/runtime-lib -I /home/opam/.opam/default/lib/ppx_module_timer/runtime -I /home/opam/.opam/default/lib/ppx_sexp_conv/runtime-lib -I /home/opam/.opam/default/lib/sexplib -I /home/opam/.opam/default/lib/sexplib/unix -I /home/opam/.opam/default/lib/sexplib0 -I /home/opam/.opam/default/lib/spawn -I /home/opam/.opam/default/lib/splittable_random -I /home/opam/.opam/default/lib/stdio -I /home/opam/.opam/default/lib/time_now -I /home/opam/.opam/default/lib/timezone -I /home/opam/.opam/default/lib/typerep -I /home/opam/.opam/default/lib/variantslib -no-alias-deps -open Webidl_syntax -o webidl/src/syntax/.webidl_syntax.objs/byte/webidl_syntax__Parser_extend.cmi -c -intf webidl/src/syntax/parser_extend.pp.mli)
- File "webidl/src/syntax/parser_extend.mli", line 3, characters 11-16:
- 3 |           (Param : sig
-                ^^^^^
- Warning 67 [unused-functor-parameter]: unused functor parameter Param.
- (cd _build/default && /home/opam/.opam/default/bin/ocamlc.opt -w -40 -w +a-4-40-41-42-44-45-48-33 -g -bin-annot -I webidl/src/syntax/.webidl_syntax.objs/byte -I /home/opam/.opam/default/lib/base -I /home/opam/.opam/default/lib/base/base_internalhash_types -I /home/opam/.opam/default/lib/base/caml -I /home/opam/.opam/default/lib/base/md5 -I /home/opam/.opam/default/lib/base/shadow_stdlib -I /home/opam/.opam/default/lib/base_bigstring -I /home/opam/.opam/default/lib/base_quickcheck -I /home/opam/.opam/default/lib/bin_prot -I /home/opam/.opam/default/lib/bin_prot/shape -I /home/opam/.opam/default/lib/core -I /home/opam/.opam/default/lib/core/error_checking_mutex -I /home/opam/.opam/default/lib/core_kernel -I /home/opam/.opam/default/lib/core_kernel/base_for_tests -I /home/opam/.opam/default/lib/core_kernel/caml_unix -I /home/opam/.opam/default/lib/core_kernel/flags -I /home/opam/.opam/default/lib/core_kernel/version_util -I /home/opam/.opam/default/lib/fieldslib -I /home/opam/.opam/default/lib/jane-street-headers -I /home/opam/.opam/default/lib/ocaml/threads -I /home/opam/.opam/default/lib/parsexp -I /home/opam/.opam/default/lib/ppx_assert/runtime-lib -I /home/opam/.opam/default/lib/ppx_bench/runtime-lib -I /home/opam/.opam/default/lib/ppx_compare/runtime-lib -I /home/opam/.opam/default/lib/ppx_enumerate/runtime-lib -I /home/opam/.opam/default/lib/ppx_expect/collector -I /home/opam/.opam/default/lib/ppx_expect/common -I /home/opam/.opam/default/lib/ppx_expect/config -I /home/opam/.opam/default/lib/ppx_expect/config_types -I /home/opam/.opam/default/lib/ppx_hash/runtime-lib -I /home/opam/.opam/default/lib/ppx_here/runtime-lib -I /home/opam/.opam/default/lib/ppx_inline_test/config -I /home/opam/.opam/default/lib/ppx_inline_test/runtime-lib -I /home/opam/.opam/default/lib/ppx_module_timer/runtime -I /home/opam/.opam/default/lib/ppx_sexp_conv/runtime-lib -I /home/opam/.opam/default/lib/sexplib -I /home/opam/.opam/default/lib/sexplib/unix -I /home/opam/.opam/default/lib/sexplib0 -I /home/opam/.opam/default/lib/spawn -I /home/opam/.opam/default/lib/splittable_random -I /home/opam/.opam/default/lib/stdio -I /home/opam/.opam/default/lib/time_now -I /home/opam/.opam/default/lib/timezone -I /home/opam/.opam/default/lib/typerep -I /home/opam/.opam/default/lib/variantslib -no-alias-deps -open Webidl_syntax -o webidl/src/syntax/.webidl_syntax.objs/byte/webidl_syntax__Lexer.cmo -c -impl webidl/src/syntax/lexer.pp.ml)
- File "webidl/src/syntax/lexer.pp.ml", line 1:
- Warning 70 [missing-mli]: Cannot find interface file.
- File "bin/dune", line 2, characters 8-11:
- 2 |  (names gen)
-             ^^^
- (cd _build/default && /home/opam/.opam/default/bin/ocamlopt.opt -w -40 -g -o bin/gen.exe /home/opam/.opam/default/lib/base/base_internalhash_types/base_internalhash_types.cmxa -I /home/opam/.opam/default/lib/base/base_internalhash_types /home/opam/.opam/default/lib/base/caml/caml.cmxa /home/opam/.opam/default/lib/sexplib0/sexplib0.cmxa /home/opam/.opam/default/lib/base/shadow_stdlib/shadow_stdlib.cmxa /home/opam/.opam/default/lib/base/base.cmxa -I /home/opam/.opam/default/lib/base /home/opam/.opam/default/lib/ppx_sexp_conv/runtime-lib/ppx_sexp_conv_lib.cmxa /home/opam/.opam/default/lib/ppx_here/runtime-lib/ppx_here_lib.cmxa /home/opam/.opam/default/lib/ppx_inline_test/config/inline_test_config.cmxa /home/opam/.opam/default/lib/jane-street-headers/jane_street_headers.cmxa /home/opam/.opam/default/lib/ppx_compare/runtime-lib/ppx_compare_lib.cmxa /home/opam/.opam/default/lib/ppx_enumerate/runtime-lib/ppx_enumerate_lib.cmxa /home/opam/.opam/default/lib/ppx_hash/runtime-lib/ppx_hash_lib.cmxa /home/opam/.opam/default/lib/time_now/time_now.cmxa -I /home/opam/.opam/default/lib/time_now /home/opam/.opam/default/lib/ppx_inline_test/runtime-lib/ppx_inline_test_lib.cmxa /home/opam/.opam/default/lib/ppx_bench/runtime-lib/ppx_bench_lib.cmxa /home/opam/.opam/default/lib/ppx_assert/runtime-lib/ppx_assert_lib.cmxa /home/opam/.opam/default/lib/splittable_random/splittable_random.cmxa /home/opam/.opam/default/lib/fieldslib/fieldslib.cmxa /home/opam/.opam/default/lib/base_quickcheck/base_quickcheck.cmxa /home/opam/.opam/default/lib/base/md5/md5_lib.cmxa /home/opam/.opam/default/lib/variantslib/variantslib.cmxa /home/opam/.opam/default/lib/bin_prot/shape/bin_shape_lib.cmxa /home/opam/.opam/default/lib/bin_prot/bin_prot.cmxa -I /home/opam/.opam/default/lib/bin_prot /home/opam/.opam/default/lib/stdio/stdio.cmxa /home/opam/.opam/default/lib/ppx_module_timer/runtime/ppx_module_timer_runtime.cmxa /home/opam/.opam/default/lib/typerep/typerep_lib.cmxa /home/opam/.opam/default/lib/ppx_expect/common/expect_test_common.cmxa /home/opam/.opam/default/lib/ppx_expect/config_types/expect_test_config_types.cmxa /home/opam/.opam/default/lib/ppx_expect/collector/expect_test_collector.cmxa -I /home/opam/.opam/default/lib/ppx_expect/collector /home/opam/.opam/default/lib/ppx_expect/config/expect_test_config.cmxa /home/opam/.opam/default/lib/base_bigstring/base_bigstring.cmxa -I /home/opam/.opam/default/lib/base_bigstring /home/opam/.opam/default/lib/core_kernel/base_for_tests/base_for_tests.cmxa /home/opam/.opam/default/lib/ocaml/unix.cmxa -I /home/opam/.opam/default/lib/ocaml /home/opam/.opam/default/lib/ocaml/bigarray.cmxa -I /home/opam/.opam/default/lib/ocaml /home/opam/.opam/default/lib/parsexp/parsexp.cmxa /home/opam/.opam/default/lib/sexplib/sexplib.cmxa /home/opam/.opam/default/lib/core_kernel/core_kernel.cmxa -I /home/opam/.opam/default/lib/core_kernel /home/opam/.opam/default/lib/ocaml/threads/threads.cmxa -I /home/opam/.opam/default/lib/ocaml /home/opam/.opam/default/lib/core/error_checking_mutex/error_checking_mutex.cmxa -I /home/opam/.opam/default/lib/core/error_checking_mutex /home/opam/.opam/default/lib/core_kernel/caml_unix/caml_unix.cmxa /home/opam/.opam/default/lib/core_kernel/flags/flags.cmxa /home/opam/.opam/default/lib/core_kernel/version_util/version_util.cmxa -I /home/opam/.opam/default/lib/core_kernel/version_util /home/opam/.opam/default/lib/sexplib/unix/sexplib_unix.cmxa /home/opam/.opam/default/lib/spawn/spawn.cmxa -I /home/opam/.opam/default/lib/spawn /home/opam/.opam/default/lib/timezone/timezone.cmxa /home/opam/.opam/default/lib/core/core.cmxa -I /home/opam/.opam/default/lib/core /home/opam/.opam/default/lib/core_kernel/moption/moption.cmxa /home/opam/.opam/default/lib/core_kernel/tuple_pool/tuple_pool.cmxa /home/opam/.opam/default/lib/core_kernel/pairing_heap/pairing_heap.cmxa /home/opam/.opam/default/lib/core_kernel/sexp_hidden_in_test/sexp_hidden_in_test.cmxa /home/opam/.opam/default/lib/core_kernel/thread_pool_cpu_affinity/thread_pool_cpu_affinity.cmxa /home/opam/.opam/default/lib/core_kernel/uopt/uopt.cmxa /home/opam/.opam/default/lib/core_kernel/thread_safe_queue/thread_safe_queue.cmxa /home/opam/.opam/default/lib/core_kernel/timing_wheel/timing_wheel.cmxa /home/opam/.opam/default/lib/async_kernel/async_kernel.cmxa /home/opam/.opam/default/lib/core/bigstring_unix/bigstring_unix.cmxa -I /home/opam/.opam/default/lib/core/bigstring_unix /home/opam/.opam/default/lib/core_kernel/bounded_int_table/bounded_int_table.cmxa /home/opam/.opam/default/lib/core_kernel/iobuf/iobuf.cmxa /home/opam/.opam/default/lib/core/iobuf_unix/iobuf_unix.cmxa -I /home/opam/.opam/default/lib/core/iobuf_unix /home/opam/.opam/default/lib/core/nano_mutex/nano_mutex.cmxa /home/opam/.opam/default/lib/core/squeue/squeue.cmxa /home/opam/.opam/default/lib/core/linux_ext/linux_ext.cmxa -I /home/opam/.opam/default/lib/core/linux_ext /home/opam/.opam/default/lib/async_unix/thread_safe_ivar/thread_safe_ivar.cmxa /home/opam/.opam/default/lib/async_unix/thread_pool/thread_pool.cmxa /home/opam/.opam/default/lib/core/time_stamp_counter/time_stamp_counter.cmxa -I /home/opam/.opam/default/lib/core/time_stamp_counter /home/opam/.opam/default/lib/core_kernel/uuid/uuid.cmxa /home/opam/.opam/default/lib/core/uuid/uuid_unix.cmxa /home/opam/.opam/default/lib/async_unix/async_unix.cmxa -I /home/opam/.opam/default/lib/async_unix /home/opam/.opam/default/lib/async/async_command/async_command.cmxa /home/opam/.opam/default/lib/async/async_quickcheck/async_quickcheck.cmxa /home/opam/.opam/default/lib/async_kernel/persistent_connection_kernel/persistent_connection_kernel.cmxa /home/opam/.opam/default/lib/protocol_version_header/protocol_version_header.cmxa /home/opam/.opam/default/lib/async_rpc_kernel/async_rpc_kernel.cmxa /home/opam/.opam/default/lib/async/async_rpc/async_rpc.cmxa -I /home/opam/.opam/default/lib/async/async_rpc /home/opam/.opam/default/lib/async/async.cmxa -I /home/opam/.opam/default/lib/ocaml webidl/src/syntax/webidl_syntax.cmxa webidl/src/lib/webidl.cmxa /home/opam/.opam/default/lib/result/result.cmxa /home/opam/.opam/default/lib/ppx_deriving/runtime/ppx_deriving_runtime.cmxa /home/opam/.opam/default/lib/js_of_ocaml-compiler/runtime/jsoo_runtime.cmxa -I /home/opam/.opam/default/lib/js_of_ocaml-compiler/runtime /home/opam/.opam/default/lib/js_of_ocaml/js_of_ocaml.cmxa -I /home/opam/.opam/default/lib/js_of_ocaml /home/opam/.opam/default/lib/lwt/lwt.cmxa /home/opam/.opam/default/lib/js_of_ocaml-lwt/js_of_ocaml_lwt.cmxa lib/js_of_ocaml_webidl.cmxa bin/.gen.eobjs/native/dune__exe__Gen.cmx)
- /usr/bin/ld: /home/opam/.opam/default/lib/core/linux_ext/linux_ext.a(linux_ext.o): in function `camlLinux_ext__sched_setaffinity_this_thread_34469':
- /home/opam/.opam/default/.opam-switch/build/core.v0.14.1/_build/default/linux_ext/src/linux_ext.ml:697:(.text+0x4600): undefined reference to `core_unix_gettid'
- /usr/bin/ld: /home/opam/.opam/default/lib/core/linux_ext/linux_ext.a(linux_ext.o): in function `camlLinux_ext__1':
- :(.data+0x3b58): undefined reference to `core_unix_gettid'
- collect2: error: ld returned 1 exit status
- File "caml_startup", line 1:
- Error: Error during linking (exit code 1)
[ERROR] The compilation of js_of_ocaml-webidl.0.1 failed at "dune build -p js_of_ocaml-webidl -j 39 @install".
build failed... 

=== STDERR ===

2026-10-24 08:12.53: FAILED: build js_of_ocaml-webidl.0.1
2026-10-24 08:12.53: Job failed: build failed: js_of_ocaml-webidl.0.1