Build:
- 0
2026-10-24 06:27.10: New job: build async_ssl.v0.14.0 (10ddd3f0a66b)
2026-10-24 06:27.10: Waiting for resource in pool day11-builds
2026-10-24 07:28.32: Got resource from pool day11-builds
2026-10-24 07:28.32: [profile full] build async_ssl.v0.14.0
2026-10-24 07:28.32: build async_ssl.v0.14.0 (10ddd3f0a66b)
=== DEPENDENCIES (75 transitive) ===
async.v0.14.0 e35df7dfab91
async_kernel.v0.14.0 a2595a5d0d33
async_rpc_kernel.v0.14.0 5b2762827916
async_unix.v0.14.0 8f4d9552162c
base.v0.14.4 68529492c00f
base-threads.base ca51096a9c5b
base-unix.base 88a83b7ed333
base_bigstring.v0.14.0 3d4a85f9f537
base_quickcheck.v0.14.1 dc9effcd232c
bin_prot.v0.14.1 bbae0943110d
conf-libffi.2.0.0 13818097de30
conf-libssl.4 9a6f007648db
conf-pkg-config.5 26be2768a637
core.v0.14.1 1c49e7c5d8d3
core_kernel.v0.14.2 28fcb1c869b3
csexp.1.5.2 2d9aad88fd83
ctypes.0.17.1 c9104e3f8b93
ctypes-foreign.0.18.0 615fd647f05c
dune.3.24.2 354f182a4824
dune-configurator.3.24.2 c64f06298a93
fieldslib.v0.14.0 ec09be2ae319
integers.0.8.0 eee0fd306744
jane-street-headers.v0.14.0 41779cf7289b
jst-config.v0.14.1 236fd473574b
num.1.6 f5e51623b177
ocaml.4.14.4 2cc549d6f8d5
ocaml-base-compiler.4.14.4 ecbd009faad9
ocaml-compiler-libs.v0.12.4 9dbc6026593e
ocaml-config.2 c0047cbf7f6a
ocamlfind.1.9.8 775658c4e58c
octavius.1.2.2 a8e07b71d920
parsexp.v0.14.2 65ba87df2a5f
ppx_assert.v0.14.0 e2e3f5e948e8
ppx_base.v0.14.0 1df6d6193527
ppx_bench.v0.14.1 e620dc0c0f3b
ppx_bin_prot.v0.14.0 24b6cc75b6c6
ppx_cold.v0.14.0 4ccda2476513
ppx_compare.v0.14.0 2a3b4188ff6c
ppx_custom_printf.v0.14.1 8795f3ea2c37
ppx_derivers.1.2.1 0e78ab2c0cc7
ppx_enumerate.v0.14.0 87f5d352d9f2
ppx_expect.v0.14.2 f27903750a0d
ppx_fields_conv.v0.14.2 0389fa135e41
ppx_fixed_literal.v0.14.0 40c97805f4d5
ppx_hash.v0.14.0 7a93ec7d7649
ppx_here.v0.14.0 6afe67c73e6e
ppx_inline_test.v0.14.1 d8ca9087f9db
ppx_jane.v0.14.0 5ca79d457fc8
ppx_js_style.v0.14.1 83b5a038146b
ppx_let.v0.14.0 2472078802bb
ppx_module_timer.v0.14.0 45cac2b964c4
ppx_optcomp.v0.14.3 dfc421cee137
ppx_optional.v0.14.0 a7c3a606c4bc
ppx_pipebang.v0.14.0 ea6b82aa8872
ppx_sexp_conv.v0.14.3 5785af2bfe55
ppx_sexp_message.v0.14.1 86f7aadd2dec
ppx_sexp_value.v0.14.0 14b6a8209cb1
ppx_stable.v0.14.1 32468864cf47
ppx_string.v0.14.1 8abe3f9360b6
ppx_typerep_conv.v0.14.2 08ec327d4656
ppx_variants_conv.v0.14.2 00b3e7dad793
ppxlib.0.25.1 6c569d382c36
protocol_version_header.v0.14.0 41c0e563cb19
re.1.14.0 276e92479e7e
sexplib.v0.14.0 c51884c6d27d
sexplib0.v0.14.0 2b713b400df2
spawn.v0.17.0 c27e7cc71e39
splittable_random.v0.14.0 f62d528d4a51
stdio.v0.14.0 d83f158f769d
stdlib-shims.0.3.0 419cf0ff9040
textutils.v0.14.0 e1d92cf04733
time_now.v0.14.0 61d05bde600f
timezone.v0.14.0 5c187ab03593
typerep.v0.14.0 3efe34979914
variantslib.v0.14.0 f773556f0ce5
=== STDOUT ===
Processing: [default: loading data]
[async_ssl.v0.14.0: dl]
[async_ssl.v0.14.0: extract]
-> retrieved async_ssl.v0.14.0 (https://opam.ocaml.org/cache)
[async_ssl: dune build]
+ /home/opam/.opam/default/bin/dune "build" "-p" "async_ssl" "-j" "39" (CWD=/home/opam/.opam/default/.opam-switch/build/async_ssl.v0.14.0)
- (cd _build/default/bindings && /usr/bin/gcc -O2 -fno-strict-aliasing -fwrapv -pthread -fPIC -D_FILE_OFFSET_BITS=64 -O2 -fno-strict-aliasing -fwrapv -pthread -fPIC -g -I /home/opam/.opam/default/lib/ocaml -I /home/opam/.opam/default/lib/base -I /home/opam/.opam/default/lib/base/base_internalhash_types -I /home/opam/.opam/default/lib/base/caml -I /home/opam/.opam/default/lib/base/md5 -I /home/opam/.opam/default/lib/base/shadow_stdlib -I /home/opam/.opam/default/lib/base_quickcheck -I /home/opam/.opam/default/lib/bin_prot -I /home/opam/.opam/default/lib/bin_prot/shape -I /home/opam/.opam/default/lib/bytes -I /home/opam/.opam/default/lib/ctypes -I /home/opam/.opam/default/lib/fieldslib -I /home/opam/.opam/default/lib/integers -I /home/opam/.opam/default/lib/jane-street-headers -I /home/opam/.opam/default/lib/ocaml/threads -I /home/opam/.opam/default/lib/ppx_assert/runtime-lib -I /home/opam/.opam/default/lib/ppx_bench/runtime-lib -I /home/opam/.opam/default/lib/ppx_compare/runtime-lib -I /home/opam/.opam/default/lib/ppx_enumerate/runtime-lib -I /home/opam/.opam/default/lib/ppx_expect/collector -I /home/opam/.opam/default/lib/ppx_expect/common -I /home/opam/.opam/default/lib/ppx_expect/config -I /home/opam/.opam/default/lib/ppx_expect/config_types -I /home/opam/.opam/default/lib/ppx_hash/runtime-lib -I /home/opam/.opam/default/lib/ppx_here/runtime-lib -I /home/opam/.opam/default/lib/ppx_inline_test/config -I /home/opam/.opam/default/lib/ppx_inline_test/runtime-lib -I /home/opam/.opam/default/lib/ppx_module_timer/runtime -I /home/opam/.opam/default/lib/ppx_sexp_conv/runtime-lib -I /home/opam/.opam/default/lib/sexplib0 -I /home/opam/.opam/default/lib/splittable_random -I /home/opam/.opam/default/lib/stdio -I /home/opam/.opam/default/lib/stdlib-shims -I /home/opam/.opam/default/lib/time_now -I /home/opam/.opam/default/lib/typerep -I /home/opam/.opam/default/lib/variantslib -o openssl_helpers.o -c openssl_helpers.c)
- openssl_helpers.c: In function 'async_ssl__subject_alt_names':
- openssl_helpers.c:66:9: warning: 'ASN1_STRING_data' is deprecated: Since OpenSSL 1.1.0 [-Wdeprecated-declarations]
- 66 | cstr = ASN1_STRING_data(gen->d.dNSName);
- | ^~~~
- In file included from /usr/include/openssl/objects.h:21,
- from /usr/include/openssl/evp.h:47,
- from /usr/include/openssl/x509.h:31,
- from /usr/include/openssl/x509v3.h:27,
- from openssl_helpers.c:2:
- /usr/include/openssl/asn1.h:671:40: note: declared here
- 671 | OSSL_DEPRECATEDIN_1_1_0 unsigned char *ASN1_STRING_data(ASN1_STRING *x);
- | ^~~~~~~~~~~~~~~~
- File "src/dune", line 16, characters 10-29:
- 16 | (c_names ffi_generated_stubs) (flags :standard -w -9-27-32-34)
- ^^^^^^^^^^^^^^^^^^^
- (cd _build/default/src && /usr/bin/gcc -O2 -fno-strict-aliasing -fwrapv -pthread -fPIC -D_FILE_OFFSET_BITS=64 -O2 -fno-strict-aliasing -fwrapv -pthread -fPIC -w -g -I /home/opam/.opam/default/lib/ocaml -I /home/opam/.opam/default/lib/async -I /home/opam/.opam/default/lib/async/async_command -I /home/opam/.opam/default/lib/async/async_quickcheck -I /home/opam/.opam/default/lib/async/async_rpc -I /home/opam/.opam/default/lib/async_kernel -I /home/opam/.opam/default/lib/async_kernel/persistent_connection_kernel -I /home/opam/.opam/default/lib/async_rpc_kernel -I /home/opam/.opam/default/lib/async_unix -I /home/opam/.opam/default/lib/async_unix/thread_pool -I /home/opam/.opam/default/lib/async_unix/thread_safe_ivar -I /home/opam/.opam/default/lib/base -I /home/opam/.opam/default/lib/base/base_internalhash_types -I /home/opam/.opam/default/lib/base/caml -I /home/opam/.opam/default/lib/base/md5 -I /home/opam/.opam/default/lib/base/shadow_stdlib -I /home/opam/.opam/default/lib/base_bigstring -I /home/opam/.opam/default/lib/base_quickcheck -I /home/opam/.opam/default/lib/bin_prot -I /home/opam/.opam/default/lib/bin_prot/shape -I /home/opam/.opam/default/lib/bytes -I /home/opam/.opam/default/lib/core -I /home/opam/.opam/default/lib/core/bigstring_unix -I /home/opam/.opam/default/lib/core/error_checking_mutex -I /home/opam/.opam/default/lib/core/iobuf_unix -I /home/opam/.opam/default/lib/core/linux_ext -I /home/opam/.opam/default/lib/core/nano_mutex -I /home/opam/.opam/default/lib/core/squeue -I /home/opam/.opam/default/lib/core/time_stamp_counter -I /home/opam/.opam/default/lib/core/uuid -I /home/opam/.opam/default/lib/core_kernel -I /home/opam/.opam/default/lib/core_kernel/base_for_tests -I /home/opam/.opam/default/lib/core_kernel/bounded_int_table -I /home/opam/.opam/default/lib/core_kernel/caml_unix -I /home/opam/.opam/default/lib/core_kernel/flags -I /home/opam/.opam/default/lib/core_kernel/iobuf -I /home/opam/.opam/default/lib/core_kernel/moption -I /home/opam/.opam/default/lib/core_kernel/pairing_heap -I /home/opam/.opam/default/lib/core_kernel/sexp_hidden_in_test -I /home/opam/.opam/default/lib/core_kernel/thread_pool_cpu_affinity -I /home/opam/.opam/default/lib/core_kernel/thread_safe_queue -I /home/opam/.opam/default/lib/core_kernel/timing_wheel -I /home/opam/.opam/default/lib/core_kernel/tuple_pool -I /home/opam/.opam/default/lib/core_kernel/uopt -I /home/opam/.opam/default/lib/core_kernel/uuid -I /home/opam/.opam/default/lib/core_kernel/version_util -I /home/opam/.opam/default/lib/ctypes -I /home/opam/.opam/default/lib/fieldslib -I /home/opam/.opam/default/lib/integers -I /home/opam/.opam/default/lib/jane-street-headers -I /home/opam/.opam/default/lib/ocaml/threads -I /home/opam/.opam/default/lib/parsexp -I /home/opam/.opam/default/lib/ppx_assert/runtime-lib -I /home/opam/.opam/default/lib/ppx_bench/runtime-lib -I /home/opam/.opam/default/lib/ppx_compare/runtime-lib -I /home/opam/.opam/default/lib/ppx_enumerate/runtime-lib -I /home/opam/.opam/default/lib/ppx_expect/collector -I /home/opam/.opam/default/lib/ppx_expect/common -I /home/opam/.opam/default/lib/ppx_expect/config -I /home/opam/.opam/default/lib/ppx_expect/config_types -I /home/opam/.opam/default/lib/ppx_hash/runtime-lib -I /home/opam/.opam/default/lib/ppx_here/runtime-lib -I /home/opam/.opam/default/lib/ppx_inline_test/config -I /home/opam/.opam/default/lib/ppx_inline_test/runtime-lib -I /home/opam/.opam/default/lib/ppx_module_timer/runtime -I /home/opam/.opam/default/lib/ppx_sexp_conv/runtime-lib -I /home/opam/.opam/default/lib/protocol_version_header -I /home/opam/.opam/default/lib/sexplib -I /home/opam/.opam/default/lib/sexplib/unix -I /home/opam/.opam/default/lib/sexplib0 -I /home/opam/.opam/default/lib/spawn -I /home/opam/.opam/default/lib/splittable_random -I /home/opam/.opam/default/lib/stdio -I /home/opam/.opam/default/lib/stdlib-shims -I /home/opam/.opam/default/lib/time_now -I /home/opam/.opam/default/lib/timezone -I /home/opam/.opam/default/lib/typerep -I /home/opam/.opam/default/lib/variantslib -I ../bindings -o ffi_generated_stubs.o -c ffi_generated_stubs.c)
- ffi_generated_stubs.c: In function 'async_ssl_stub_14_ENGINE_load_builtin_engines':
- ffi_generated_stubs.c:80:4: error: implicit declaration of function 'ENGINE_load_builtin_engines' [-Wimplicit-function-declaration]
- 80 | ENGINE_load_builtin_engines();
- | ^~~~~~~~~~~~~~~~~~~~~~~~~~~
- ffi_generated_stubs.c: In function 'async_ssl_stub_15_ENGINE_unregister_RAND':
- ffi_generated_stubs.c:85:4: error: implicit declaration of function 'ENGINE_unregister_RAND' [-Wimplicit-function-declaration]
- 85 | ENGINE_unregister_RAND();
- | ^~~~~~~~~~~~~~~~~~~~~~
- ffi_generated_stubs.c: In function 'async_ssl_stub_16_ENGINE_register_all_complete':
- ffi_generated_stubs.c:90:4: error: implicit declaration of function 'ENGINE_register_all_complete' [-Wimplicit-function-declaration]
- 90 | ENGINE_register_all_complete();
- | ^~~~~~~~~~~~~~~~~~~~~~~~~~~~
- ffi_generated_stubs.c: In function 'async_ssl_stub_50_BN_hex2bn':
- ffi_generated_stubs.c:315:25: error: passing argument 1 of 'BN_hex2bn' from incompatible pointer type [-Wincompatible-pointer-types]
- 315 | int x199 = BN_hex2bn(x197, x198);
- | ^~~~
- | |
- | void **
- In file included from /usr/include/openssl/params.h:16,
- from /usr/include/openssl/indicator.h:18,
- from /usr/include/openssl/core_dispatch.h:16,
- from /usr/include/openssl/evp.h:28,
- from /usr/include/openssl/x509.h:31,
- from /usr/include/openssl/ssl.h:34,
- from ffi_generated_stubs.c:2:
- /usr/include/openssl/bn.h:345:24: note: expected 'BIGNUM **' {aka 'struct bignum_st **'} but argument is of type 'void **'
- 345 | int BN_hex2bn(BIGNUM **a, const char *str);
- | ~~~~~~~~~^
- ffi_generated_stubs.c: In function 'async_ssl_stub_72_SSL_set_tmp_dh_callback':
- ffi_generated_stubs.c:467:34: error: passing argument 2 of 'SSL_set_tmp_dh_callback' from incompatible pointer type [-Wincompatible-pointer-types]
- 467 | SSL_set_tmp_dh_callback(x320, x321);
- | ^~~~
- | |
- | void * (*)(void *, _Bool, int)
- /usr/include/openssl/ssl.h:2282:11: note: expected 'DH * (*)(SSL *, int, int)' {aka 'struct dh_st * (*)(struct ssl_st *, int, int)'} but argument is of type 'void * (*)(void *, _Bool, int)'
- 2282 | DH *(*dh)(SSL *ssl, int is_export,
- | ~~~~~~^~~~~~~~~~~~~~~~~~~~~~~~~~~~
- 2283 | int keylength));
- | ~~~~~~~~~~~~~~
[ERROR] The compilation of async_ssl.v0.14.0 failed at "dune build -p async_ssl -j 39".
build failed...
=== STDERR ===
2026-10-24 07:31.29: FAILED: build async_ssl.v0.14.0
2026-10-24 07:31.29: Job failed: build failed: async_ssl.v0.14.0