Build:
  1. 1
  2. 0
2026-10-24 00:31.09: New job: build orocksdb.0.2.2 (53fcfbfd0fdf)
2026-10-24 00:31.09: Waiting for resource in pool day11-builds
2026-10-24 01:02.23: Got resource from pool day11-builds
2026-10-24 01:02.23: [profile full] build orocksdb.0.2.2
2026-10-24 01:02.23: build orocksdb.0.2.2 (53fcfbfd0fdf)
=== DEPENDENCIES (18 transitive) ===
  base-threads.base                                  ca51096a9c5b
  base-unix.base                                     88a83b7ed333
  compiler-cloning.enabled                           1aa529c962c5
  conf-libffi.2.0.0                                  13818097de30
  conf-pkg-config.5                                  26be2768a637
  conf-rocksdb.2                                     03cbd74c3788
  csexp.1.5.2                                        a054117ec731
  ctypes.0.24.0                                      47f10cccd00f
  ctypes-foreign.0.24.0                              be7375faf259
  dune.3.24.2                                        6cd6abc0b8c5
  dune-configurator.3.24.2                           bd4df6cc6c29
  integers.0.8.0                                     4941a7183be6
  ocaml.5.5.2                                        3d66d99b0b38
  ocaml-base-compiler.5.5.2                          546a7f1026cd
  ocaml-compiler.5.5.2                               956e368db607
  ocamlbuild.0.16.1                                  2941453b8670
  ocamlfind.1.9.9~preview                            36cecca1627b
  stdlib-shims.0.3.0                                 a055673b5749
=== STDOUT ===
Processing: [default: loading data]
[orocksdb.0.2.2: dl]
[orocksdb.0.2.2: extract]
-> retrieved orocksdb.0.2.2  (https://opam.ocaml.org/cache)
[orocksdb: make]
+ /usr/bin/make  (CWD=/home/opam/.opam/default/.opam-switch/build/orocksdb.0.2.2)
- ocamlbuild -use-ocamlfind -lflags -cclib,/usr/local/lib/librocksdb.so rocks.inferred.mli rocks.cma rocks.cmxa rocks.cmxs rocks_options.inferred.mli
- + ocamlfind ocamlc -config
- + ocamlfind ocamldep -package ctypes.foreign -package ctypes -modules rocks.ml > rocks.ml.depends
- + ocamlfind ocamldep -package ctypes.foreign -package ctypes -modules rocks_common.ml > rocks_common.ml.depends
- + ocamlfind ocamldep -package ctypes.foreign -package ctypes -modules rocks_options.ml > rocks_options.ml.depends
- + ocamlfind ocamlc -c -g -annot -package ctypes.foreign -package ctypes -o rocks_common.cmo rocks_common.ml
- + ocamlfind ocamlc -c -g -annot -package ctypes.foreign -package ctypes -o rocks_options.cmo rocks_options.ml
- + ocamlfind ocamlc -i -package ctypes.foreign -package ctypes rocks.ml > rocks.inferred.mli
- + ocamlfind ocamlc -i -package ctypes.foreign -package ctypes rocks.ml > rocks.inferred.mli
- File "rocks.ml", line 172, characters 19-34:
- 172 |         let res' = string_from_ptr res (!@ res_size) in
-                          ^^^^^^^^^^^^^^^
- Warning 6 [labels-omitted]: label length was omitted in the application of
-   this function.
- 
- File "rocks.ml", line 277, characters 9-24:
- 277 |     else string_from_ptr res (!@ res_size)
-                ^^^^^^^^^^^^^^^
- Warning 6 [labels-omitted]: label length was omitted in the application of
-   this function.
- 
- File "rocks.ml", line 296, characters 9-24:
- 296 |     else string_from_ptr res (!@ res_size)
-                ^^^^^^^^^^^^^^^
- Warning 6 [labels-omitted]: label length was omitted in the application of
-   this function.
- + ocamlfind ocamldep -package ctypes.foreign -package ctypes -modules rocks.mli > rocks.mli.depends
- + ocamlfind ocamlc -c -g -annot -package ctypes.foreign -package ctypes -o rocks.cmi rocks.mli
- + ocamlfind ocamlc -c -g -annot -package ctypes.foreign -package ctypes -o rocks.cmo rocks.ml
- + ocamlfind ocamlc -c -g -annot -package ctypes.foreign -package ctypes -o rocks.cmo rocks.ml
- File "rocks.ml", line 172, characters 19-34:
- 172 |         let res' = string_from_ptr res (!@ res_size) in
-                          ^^^^^^^^^^^^^^^
- Warning 6 [labels-omitted]: label length was omitted in the application of
-   this function.
- 
- File "rocks.ml", line 277, characters 9-24:
- 277 |     else string_from_ptr res (!@ res_size)
-                ^^^^^^^^^^^^^^^
- Warning 6 [labels-omitted]: label length was omitted in the application of
-   this function.
- 
- File "rocks.ml", line 296, characters 9-24:
- 296 |     else string_from_ptr res (!@ res_size)
-                ^^^^^^^^^^^^^^^
- Warning 6 [labels-omitted]: label length was omitted in the application of
-   this function.
- + ocamlfind ocamlc -a -cclib /usr/local/lib/librocksdb.so -package ctypes.foreign -package ctypes rocks_common.cmo rocks_options.cmo rocks.cmo -o rocks.cma
- + ocamlfind ocamlopt -c -g -annot -package ctypes.foreign -package ctypes -o rocks_common.cmx rocks_common.ml
- + ocamlfind ocamlopt -c -g -annot -package ctypes.foreign -package ctypes -o rocks_options.cmx rocks_options.ml
- + ocamlfind ocamlopt -c -g -annot -package ctypes.foreign -package ctypes -o rocks.cmx rocks.ml
- + ocamlfind ocamlopt -c -g -annot -package ctypes.foreign -package ctypes -o rocks.cmx rocks.ml
- File "rocks.ml", line 172, characters 19-34:
- 172 |         let res' = string_from_ptr res (!@ res_size) in
-                          ^^^^^^^^^^^^^^^
- Warning 6 [labels-omitted]: label length was omitted in the application of
-   this function.
- 
- File "rocks.ml", line 277, characters 9-24:
- 277 |     else string_from_ptr res (!@ res_size)
-                ^^^^^^^^^^^^^^^
- Warning 6 [labels-omitted]: label length was omitted in the application of
-   this function.
- 
- File "rocks.ml", line 296, characters 9-24:
- 296 |     else string_from_ptr res (!@ res_size)
-                ^^^^^^^^^^^^^^^
- Warning 6 [labels-omitted]: label length was omitted in the application of
-   this function.
- + ocamlfind ocamlopt -a -cclib /usr/local/lib/librocksdb.so -package ctypes.foreign -package ctypes rocks_common.cmx rocks_options.cmx rocks.cmx -o rocks.cmxa
- + ocamlfind ocamlopt -shared -cclib /usr/local/lib/librocksdb.so -linkall -package ctypes.foreign -package ctypes rocks.cmxa -o rocks.cmxs
- + ocamlfind ocamlopt -shared -cclib /usr/local/lib/librocksdb.so -linkall -package ctypes.foreign -package ctypes rocks.cmxa -o rocks.cmxs
- /usr/bin/ld: cannot find /usr/local/lib/librocksdb.so: No such file or directory
- /usr/bin/ld: cannot find /usr/local/lib/librocksdb.so: No such file or directory
- collect2: error: ld returned 1 exit status
- File "caml_startup", line 1:
- Error: Error during linking (exit code 1)
- Command exited with code 2.
- make: *** [Makefile:7: build] Error 10
[ERROR] The compilation of orocksdb.0.2.2 failed at "make".
build failed... 

=== STDERR ===

2026-10-24 01:02.44: FAILED: build orocksdb.0.2.2
2026-10-24 01:02.44: Job failed: build failed: orocksdb.0.2.2