Build:
  1. 1
  2. 0
2026-10-24 00:04.22: New job: build raygui.1.3.0 (b2954a3db30a)
2026-10-24 00:04.22: Waiting for resource in pool day11-builds
2026-10-24 00:55.41: Got resource from pool day11-builds
2026-10-24 00:55.41: [profile full] build raygui.1.3.0
2026-10-24 00:55.41: build raygui.1.3.0 (b2954a3db30a)
=== DEPENDENCIES (20 transitive) ===
  base-threads.base                                  ca51096a9c5b
  base-unix.base                                     88a83b7ed333
  compiler-cloning.enabled                           1aa529c962c5
  conf-libxcursor.1                                  fd79435f0882
  conf-libxi.1                                       dd60ec440302
  conf-libxinerama.1                                 992b60176225
  conf-libxrandr.1                                   d145e43e255d
  conf-mesa.1                                        a17afa91ab4b
  conf-pkg-config.5                                  26be2768a637
  csexp.1.5.2                                        a054117ec731
  ctypes.0.24.0                                      47f10cccd00f
  dune.3.24.2                                        6cd6abc0b8c5
  dune-configurator.3.24.2                           bd4df6cc6c29
  integers.0.8.0                                     4941a7183be6
  ocaml.5.5.2                                        3d66d99b0b38
  ocaml-base-compiler.5.5.2                          546a7f1026cd
  ocaml-compiler.5.5.2                               956e368db607
  patch.2.0.0                                        3a09ad6bff3d
  raylib.1.3.1                                       97f778b68efb
  stdlib-shims.0.3.0                                 a055673b5749
=== STDOUT ===
Processing: [default: loading data]
[raygui.1.3.0: dl]
[raygui.1.3.0: extract]
-> retrieved raygui.1.3.0  (https://opam.ocaml.org/cache)
[raygui: dune build]
+ /home/opam/.opam/default/bin/dune "build" "-p" "raygui" "-j" "39" "@install" (CWD=/home/opam/.opam/default/.opam-switch/build/raygui.1.3.0)
- File "src/c/dune", line 180, characters 9-24:
- 180 |   (names c_generated_gui)
-                ^^^^^^^^^^^^^^^
- (cd _build/default/src/c && /usr/bin/gcc -O2 -fno-strict-aliasing -fwrapv -fPIC -pthread -D_FILE_OFFSET_BITS=64 -O2 -fno-strict-aliasing -fwrapv -fPIC -pthread -g -I /home/opam/.opam/default/lib/ocaml -I /home/opam/.opam/default/lib/ctypes -I /home/opam/.opam/default/lib/ctypes/stubs -I /home/opam/.opam/default/lib/integers -I /home/opam/.opam/default/lib/ocaml/str -I /home/opam/.opam/default/lib/raylib/__private__/raylib_fixed_types -I /home/opam/.opam/default/lib/raylib/__private__/raylib_types -I /home/opam/.opam/default/lib/stdlib-shims -I functions -I types -I vendor/raygui/src -I vendor/raylib/src -o c_generated_gui.o -c c_generated_gui.c)
- c_generated_gui.c: In function 'raygui_stub_37_GuiListViewEx':
- c_generated_gui.c:378:35: error: passing argument 2 of 'GuiListViewEx' from incompatible pointer type [-Wincompatible-pointer-types]
-   378 |    int x405 = GuiListViewEx(x395, x396, x397, x400, x401, x402);
-       |                                   ^~~~
-       |                                   |
-       |                                   const char **
- In file included from c_generated_gui.c:3:
- vendor/raygui/src/raygui.h:2724:44: note: expected 'char **' but argument is of type 'const char **'
-  2724 | int GuiListViewEx(Rectangle bounds, char **text, int count, int *focus, int *scrollIndex, int active)
-       |                                     ~~~~~~~^~~~
[ERROR] The compilation of raygui.1.3.0 failed at "dune build -p raygui -j 39 @install".
build failed... 

=== STDERR ===

2026-10-24 00:55.55: FAILED: build raygui.1.3.0
2026-10-24 00:55.55: Job failed: build failed: raygui.1.3.0