Build:
  1. 1
  2. 0
2026-10-23 23:24.57: New job: build lbfgs.0.9.2 (12d182c208ef)
2026-10-23 23:24.57: Waiting for resource in pool day11-builds
2026-10-23 23:52.41: Got resource from pool day11-builds
2026-10-23 23:52.41: [profile full] build lbfgs.0.9.2
2026-10-23 23:52.41: build lbfgs.0.9.2 (12d182c208ef)
=== DEPENDENCIES (16 transitive) ===
  base-bigarray.base                                 af90e15e33c9
  base-bytes.base                                    0447d5f52961
  base-threads.base                                  ca51096a9c5b
  base-unix.base                                     88a83b7ed333
  camlp-streams.5.0.1                                a71bd872ad18
  camlp4.5.5                                         11cdddbd6ac6
  compiler-cloning.enabled                           1aa529c962c5
  conf-gfortran.0                                    065f2c48e08e
  csexp.1.5.2                                        a054117ec731
  dune.3.24.2                                        6cd6abc0b8c5
  dune-configurator.3.24.2                           bd4df6cc6c29
  ocaml.5.5.2                                        3d66d99b0b38
  ocaml-base-compiler.5.5.2                          546a7f1026cd
  ocaml-compiler.5.5.2                               956e368db607
  ocamlbuild.0.16.1                                  2941453b8670
  ocamlfind.1.9.9~preview                            36cecca1627b
=== STDOUT ===
Processing: [default: loading data]
[lbfgs.0.9.2: dl]
[lbfgs.0.9.2: extract]
-> retrieved lbfgs.0.9.2  (https://opam.ocaml.org/cache)
[lbfgs: dune build]
+ /home/opam/.opam/default/bin/dune "build" "-p" "lbfgs" "-j" "39" (CWD=/home/opam/.opam/default/.opam-switch/build/lbfgs.0.9.2)
- File "src/dune", line 6, characters 14-25:
- 6 |  (c_names     lbfgs_stubs)
-                   ^^^^^^^^^^^
- (cd _build/default/src && /usr/bin/gcc -O2 -fno-strict-aliasing -fwrapv -fPIC -pthread -D_FILE_OFFSET_BITS=64 -O2 -fno-strict-aliasing -fwrapv -fPIC -pthread -g -I /home/opam/.opam/default/lib/ocaml -I /home/opam/.opam/default/lib/bytes -I Lbfgsb.3.0 -o lbfgs_stubs.o -c lbfgs_stubs.c)
- In file included from lbfgs_stubs.c:18:
- lbfgs_stubs.c: In function 'ocaml_lbfgs_setulb':
- /home/opam/.opam/default/lib/ocaml/caml/mlvalues.h:366:24: warning: passing argument 13 of 'setulb_' discards 'const' qualifier from pointer target type [-Wdiscarded-qualifiers]
-   366 | #define String_val(x) ((const char *) Bp_val(x))
-       |                       ~^~~~~~~~~~~~~~~~~~~~~~~~~
- lbfgs_stubs.c:92:11: note: in expansion of macro 'String_val'
-    92 |           String_val(vtask), /* shared content with OCaml */
-       |           ^~~~~~~~~~
- lbfgs_stubs.c:66:27: note: expected 'char *' but argument is of type 'const char *'
-    66 |                     char *task,
-       |                     ~~~~~~^~~~
- /home/opam/.opam/default/lib/ocaml/caml/mlvalues.h:366:24: warning: passing argument 15 of 'setulb_' discards 'const' qualifier from pointer target type [-Wdiscarded-qualifiers]
-   366 | #define String_val(x) ((const char *) Bp_val(x))
-       |                       ~^~~~~~~~~~~~~~~~~~~~~~~~~
- lbfgs_stubs.c:93:28: note: in expansion of macro 'String_val'
-    93 |           PTR_INT(iprint), String_val(vcsave),
-       |                            ^~~~~~~~~~
- lbfgs_stubs.c:68:27: note: expected 'char *' but argument is of type 'const char *'
-    68 |                     char *csave,
-       |                     ~~~~~~^~~~~
- lbfgs_stubs.c:96:10: error: implicit declaration of function 'copy_double'; did you mean 'caml_copy_double'? [-Wimplicit-function-declaration]
-    96 |   return(copy_double(f));
-       |          ^~~~~~~~~~~
-       |          caml_copy_double
[ERROR] The compilation of lbfgs.0.9.2 failed at "dune build -p lbfgs -j 39".
build failed... 

=== STDERR ===

2026-10-23 23:53.05: FAILED: build lbfgs.0.9.2
2026-10-23 23:53.05: Job failed: build failed: lbfgs.0.9.2