Build:
  1. 1
  2. 0
2026-10-23 22:18.30: New job: build dssi.0.1.3 (d93f02a02150)
2026-10-23 22:18.30: Waiting for resource in pool day11-builds
2026-10-23 23:51.54: Got resource from pool day11-builds
2026-10-23 23:51.54: [profile full] build dssi.0.1.3
2026-10-23 23:51.54: build dssi.0.1.3 (d93f02a02150)
=== DEPENDENCIES (14 transitive) ===
  base-threads.base                                  ca51096a9c5b
  base-unix.base                                     88a83b7ed333
  compiler-cloning.enabled                           1aa529c962c5
  conf-alsa.1                                        8072b75cae67
  conf-dssi.1                                        3bfd10ae938c
  conf-ladspa.1                                      2c4f407362ae
  conf-pkg-config.5                                  26be2768a637
  csexp.1.5.2                                        a054117ec731
  dune.3.24.2                                        6cd6abc0b8c5
  dune-configurator.3.24.2                           bd4df6cc6c29
  ladspa.0.2.2                                       4f52a78666c1
  ocaml.5.5.2                                        3d66d99b0b38
  ocaml-base-compiler.5.5.2                          546a7f1026cd
  ocaml-compiler.5.5.2                               956e368db607
=== STDOUT ===
Processing: [default: loading data]
[dssi.0.1.3: dl]
[dssi.0.1.3: extract]
-> retrieved dssi.0.1.3  (https://opam.ocaml.org/cache)
[dssi: dune build]
+ /home/opam/.opam/default/bin/dune "build" "-p" "dssi" "-j" "39" "@install" (CWD=/home/opam/.opam/default/.opam-switch/build/dssi.0.1.3)
- File "src/dune", line 12, characters 9-19:
- 12 |   (names dssi_stubs)
-               ^^^^^^^^^^
- (cd _build/default/src && /usr/bin/gcc -O2 -fno-strict-aliasing -fwrapv -fPIC -pthread -D_FILE_OFFSET_BITS=64 -O2 -fno-strict-aliasing -fwrapv -fPIC -pthread -g -I /home/opam/.opam/default/lib/ocaml -I /home/opam/.opam/default/lib/ladspa -o dssi_stubs.o -c dssi_stubs.c)
- dssi_stubs.c: In function 'ocaml_dssi_ladspa':
- dssi_stubs.c:86:10: error: implicit declaration of function 'Val_LADSPA_descr' [-Wimplicit-function-declaration]
-    86 |   return Val_LADSPA_descr(Descr_val(d)->LADSPA_Plugin);
-       |          ^~~~~~~~~~~~~~~~
[ERROR] The compilation of dssi.0.1.3 failed at "dune build -p dssi -j 39 @install".
build failed... 

=== STDERR ===

2026-10-23 23:52.19: FAILED: build dssi.0.1.3
2026-10-23 23:52.19: Job failed: build failed: dssi.0.1.3