Build:
  1. 1
  2. 0
2026-10-23 21:52.45: New job: build class_group_vdf.0.0.2 (38079c431203)
2026-10-23 21:52.45: Waiting for resource in pool day11-builds
2026-10-23 23:38.00: Got resource from pool day11-builds
2026-10-23 23:38.00: [profile full] build class_group_vdf.0.0.2
2026-10-23 23:38.00: build class_group_vdf.0.0.2 (38079c431203)
=== DEPENDENCIES (14 transitive) ===
  base-threads.base                                  ca51096a9c5b
  base-unix.base                                     88a83b7ed333
  compiler-cloning.enabled                           1aa529c962c5
  conf-g++.1.0                                       1a07ad722389
  conf-gmp.5                                         d0211a82c71f
  conf-pkg-config.5                                  26be2768a637
  dune.3.24.2                                        6cd6abc0b8c5
  integers.0.8.0                                     4941a7183be6
  ocaml.5.5.2                                        3d66d99b0b38
  ocaml-base-compiler.5.5.2                          546a7f1026cd
  ocaml-compiler.5.5.2                               956e368db607
  ocamlfind.1.9.9~preview                            36cecca1627b
  stdlib-shims.0.3.0                                 a055673b5749
  zarith.1.14                                        cbecd38aadee
=== STDOUT ===
Processing: [default: loading data]
[class_group_vdf.0.0.2: dl]
[class_group_vdf.0.0.2: extract]
-> retrieved class_group_vdf.0.0.2  (https://opam.ocaml.org/cache)
[class_group_vdf: dune build]
+ /home/opam/.opam/default/bin/dune "build" "-j" "39" "-p" "class_group_vdf" "@install" (CWD=/home/opam/.opam/default/.opam-switch/build/class_group_vdf.0.0.2)
[ERROR] The compilation of class_group_vdf.0.0.2 failed at "dune build -j 39 -p class_group_vdf @install".
- File "src/dune", lines 9-24, characters 0-452:
-  9 | (library
- 10 |  (name class_group_vdf)
- 11 |  (public_name class_group_vdf)
- ....
- 22 |   (flags
- 23 |    (:include stubs_flags.sexp))
- 24 |   (names cg_vdf_wrapper cg_vdf_bindings_stubs)))
- (cd _build/default && /home/opam/.opam/default/bin/ocamlmklib -g -o src/class_group_vdf_stubs src/cg_vdf_wrapper.o src/cg_vdf_bindings_stubs.o -ldopt -lgmpxx -ldopt -lgmp -ldopt -lstdc++)
- /usr/bin/ld: src/cg_vdf_wrapper.o: relocation R_X86_64_TPOFF32 against `_ZZ12rand_integeriiE7is_init' can not be used when making a shared object; recompile with -fPIC
- /usr/bin/ld: failed to set dynamic section sizes: bad value
- collect2: error: ld returned 1 exit status
build failed... 

=== STDERR ===

2026-10-23 23:38.33: FAILED: build class_group_vdf.0.0.2
2026-10-23 23:38.33: Job failed: build failed: class_group_vdf.0.0.2