Build:
  1. 0
2026-10-23 21:48.29: New job: build lo.0.2.0 (622ea2d1edb9)
2026-10-23 21:48.29: Waiting for resource in pool day11-builds
2026-10-23 22:14.10: Got resource from pool day11-builds
2026-10-23 22:14.10: [profile full] build lo.0.2.0
2026-10-23 22:14.10: build lo.0.2.0 (622ea2d1edb9)
=== DEPENDENCIES (10 transitive) ===
  base-threads.base                                  ca51096a9c5b
  base-unix.base                                     88a83b7ed333
  compiler-cloning.enabled                           1aa529c962c5
  conf-liblo.1                                       3c296600f98c
  csexp.1.5.2                                        a054117ec731
  dune.3.24.2                                        6cd6abc0b8c5
  dune-configurator.3.24.2                           bd4df6cc6c29
  ocaml.5.5.2                                        3d66d99b0b38
  ocaml-base-compiler.5.5.2                          546a7f1026cd
  ocaml-compiler.5.5.2                               956e368db607
=== STDOUT ===
Processing: [default: loading data]
[lo.0.2.0: dl]
[lo.0.2.0: extract]
-> retrieved lo.0.2.0  (https://opam.ocaml.org/cache)
[lo: dune build]
+ /home/opam/.opam/default/bin/dune "build" "-p" "lo" "-j" "39" "@install" (CWD=/home/opam/.opam/default/.opam-switch/build/lo.0.2.0)
- File "src/dune", line 9, characters 9-17:
- 9 |   (names lo_stubs)
-              ^^^^^^^^
- (cd _build/default/src && /usr/bin/gcc -O2 -fno-strict-aliasing -fwrapv -fPIC -pthread -D_FILE_OFFSET_BITS=64 -g -I /home/opam/.opam/default/lib/ocaml -I /home/opam/.opam/default/lib/ocaml/threads -I /home/opam/.opam/default/lib/ocaml/unix -o lo_stubs.o -c lo_stubs.c)
- lo_stubs.c: In function 'caml_lo_message_new':
- lo_stubs.c:70:20: error: assignment to 'lo_address' {aka 'struct lo_address_ *'} from incompatible pointer type 'lo_message' {aka 'struct lo_message_ *'} [-Wincompatible-pointer-types]
-    70 |   Address_val(ans) = m;
-       |                    ^
build failed... 
[ERROR] The compilation of lo.0.2.0 failed at "dune build -p lo -j 39 @install".

=== STDERR ===

2026-10-23 22:14.23: FAILED: build lo.0.2.0
2026-10-23 22:14.23: Job failed: build failed: lo.0.2.0