Build:
  1. 0
2026-10-23 21:48.29: New job: build fdkaac.0.3.2 (12066b981fc0)
2026-10-23 21:48.29: Waiting for resource in pool day11-builds
2026-10-23 22:12.58: Got resource from pool day11-builds
2026-10-23 22:12.58: [profile full] build fdkaac.0.3.2
2026-10-23 22:12.58: build fdkaac.0.3.2 (12066b981fc0)
=== DEPENDENCIES (9 transitive) ===
  base-threads.base                                  ca51096a9c5b
  base-unix.base                                     88a83b7ed333
  compiler-cloning.enabled                           1aa529c962c5
  csexp.1.5.2                                        a054117ec731
  dune.3.24.2                                        6cd6abc0b8c5
  dune-configurator.3.24.2                           bd4df6cc6c29
  ocaml.5.5.2                                        3d66d99b0b38
  ocaml-base-compiler.5.5.2                          546a7f1026cd
  ocaml-compiler.5.5.2                               956e368db607
=== STDOUT ===
Processing: [default: loading data]
[WARNING] These additional system packages are required, but not available on your system: libfdk-aac-dev
[fdkaac.0.3.2: dl]
[fdkaac.0.3.2: extract]
-> retrieved fdkaac.0.3.2  (https://opam.ocaml.org/cache)
[fdkaac: dune build]
+ /home/opam/.opam/default/bin/dune "build" "-p" "fdkaac" "-j" "39" "@install" (CWD=/home/opam/.opam/default/.opam-switch/build/fdkaac.0.3.2)
- File "src/dune", line 7, characters 9-21:
- 7 |   (names fdkaac_stubs)
-              ^^^^^^^^^^^^
- (cd _build/default/src && /usr/bin/gcc -O2 -fno-strict-aliasing -fwrapv -fPIC -pthread -D_FILE_OFFSET_BITS=64 -g -I /home/opam/.opam/default/lib/ocaml -o fdkaac_stubs.o -c fdkaac_stubs.c)
- fdkaac_stubs.c:33:10: fatal error: fdk-aac/aacenc_lib.h: No such file or directory
-    33 | #include <fdk-aac/aacenc_lib.h>
-       |          ^~~~~~~~~~~~~~~~~~~~~~
- compilation terminated.
[ERROR] The compilation of fdkaac.0.3.2 failed at "dune build -p fdkaac -j 39 @install".
build failed... 

=== STDERR ===

2026-10-23 22:13.27: FAILED: build fdkaac.0.3.2
2026-10-23 22:13.27: Job failed: build failed: fdkaac.0.3.2