Build:
  1. 0
2026-10-23 20:25.33: New job: build termbox.0.1.0 (29c1a5ee32fb)
2026-10-23 20:25.33: Waiting for resource in pool day11-builds
2026-10-23 20:26.36: Got resource from pool day11-builds
2026-10-23 20:26.36: [profile full] build termbox.0.1.0
2026-10-23 20:26.36: build termbox.0.1.0 (29c1a5ee32fb)
=== DEPENDENCIES (5 transitive) ===
  compiler-cloning.enabled                           1aa529c962c5
  ocaml.5.5.2                                        3d66d99b0b38
  ocaml-base-compiler.5.5.2                          546a7f1026cd
  ocaml-compiler.5.5.2                               956e368db607
  ocamlfind.1.9.9~preview                            36cecca1627b
=== STDOUT ===
Processing: [default: loading data]
[WARNING] These additional system packages are required, but not available on your system: python
[termbox.0.1.0: dl]
[termbox.0.1.0: extract]
-> retrieved termbox.0.1.0  (https://opam.ocaml.org/cache)
[termbox: make]
+ /usr/bin/make  (CWD=/home/opam/.opam/default/.opam-switch/build/termbox.0.1.0)
- cd termbox && ./waf configure && ./waf
- env: 'python': No such file or directory
- make: *** [Makefile:26: termbox/build/src/libtermbox.a] Error 127
[ERROR] The compilation of termbox.0.1.0 failed at "make".
build failed... 

=== STDERR ===

2026-10-23 20:27.19: FAILED: build termbox.0.1.0
2026-10-23 20:27.19: Job failed: build failed: termbox.0.1.0