Build:
  1. 0
2026-10-23 20:25.33: New job: build oclock.0.3.0 (4b3f1f4c3097)
2026-10-23 20:25.33: Waiting for resource in pool day11-builds
2026-10-23 20:28.01: Got resource from pool day11-builds
2026-10-23 20:28.01: [profile full] build oclock.0.3.0
2026-10-23 20:28.01: build oclock.0.3.0 (4b3f1f4c3097)
=== DEPENDENCIES (5 transitive) ===
  compiler-cloning.enabled                           1aa529c962c5
  ocaml.5.5.2                                        3d66d99b0b38
  ocaml-base-compiler.5.5.2                          546a7f1026cd
  ocaml-compiler.5.5.2                               956e368db607
  ocamlfind.1.9.9~preview                            36cecca1627b
=== STDOUT ===
Processing: [default: loading data]
[oclock.0.3.0: dl]
[oclock.0.3.0: extract]
-> retrieved oclock.0.3.0  (https://opam.ocaml.org/cache)
[oclock: make]
+ /usr/bin/make "CFLAGS=-I /home/opam/.opam/default/lib/ocaml -fPIC" (CWD=/home/opam/.opam/default/.opam-switch/build/oclock.0.3.0)
- ocamldep  *.ml *.mli > .depend
- ocamlc  -c oclock.mli
- ocamlc  -c oclock.ml
- cc -I /home/opam/.opam/default/lib/ocaml -fPIC   -c -o oclock_stubs.o oclock_stubs.c
- oclock_stubs.c: In function 'oclock_getres':
- oclock_stubs.c:65:9: error: implicit declaration of function 'copy_int64'; did you mean 'caml_copy_int64'? [-Wimplicit-function-declaration]
-    65 |   res = copy_int64(ts.tv_sec * 1000000000LL + ts.tv_nsec);
-       |         ^~~~~~~~~~
-       |         caml_copy_int64
- make: *** [<builtin>: oclock_stubs.o] Error 1
[ERROR] The compilation of oclock.0.3.0 failed at "make CFLAGS=-I /home/opam/.opam/default/lib/ocaml -fPIC".
build failed... 

=== STDERR ===

2026-10-23 20:28.55: FAILED: build oclock.0.3.0
2026-10-23 20:28.55: Job failed: build failed: oclock.0.3.0