Build:
  1. 0
2026-10-23 20:25.33: New job: build crypt.1.2 (1749126fc735)
2026-10-23 20:25.33: Waiting for resource in pool day11-builds
2026-10-23 20:29.23: Got resource from pool day11-builds
2026-10-23 20:29.23: [profile full] build crypt.1.2
2026-10-23 20:29.23: build crypt.1.2 (1749126fc735)
=== DEPENDENCIES (7 transitive) ===
  compiler-cloning.enabled                           1aa529c962c5
  ocaml.5.5.2                                        3d66d99b0b38
  ocaml-base-compiler.5.5.2                          546a7f1026cd
  ocaml-compiler.5.5.2                               956e368db607
  ocaml-makefile.6.39.2                              7832e76828f3
  ocamlbuild.0.16.1                                  2941453b8670
  ocamlfind.1.9.9~preview                            36cecca1627b
=== STDOUT ===
Processing: [default: loading data]
[crypt.1.2: dl]
[crypt.1.2: extract]
-> retrieved crypt.1.2  (https://opam.ocaml.org/cache)
[crypt: make]
+ /usr/bin/make  (CWD=/home/opam/.opam/default/.opam-switch/build/crypt.1.2)
- cd lib && /usr/bin/make
- make[1]: Entering directory '/home/opam/.opam/default/.opam-switch/build/crypt.1.2/lib'
- make[2]: Entering directory '/home/opam/.opam/default/.opam-switch/build/crypt.1.2/lib'
- ocamldep crypt.ml > ._d/crypt.d
- ocamldep -native crypt.mli > ._ncdi/crypt.di
- /home/opam/.opam/default/lib/ocaml-makefile/OCamlMakefile:1163: warning: pattern recipe did not update peer target '._bcdi/crypt.di'.
- /home/opam/.opam/default/bin/ocamlopt.opt   \
- 			-c -cc "cc"     -ccopt "-fPIC  \
- 			-DPIC -DNATIVE_CODE   \
- 			    -o crypt_stubs.o " crypt_stubs.c
- crypt_stubs.c: In function 'crypt_raw':
- crypt_stubs.c:14:18: error: implicit declaration of function 'crypt' [-Wimplicit-function-declaration]
-    14 |   char *result = crypt(String_val(key), String_val(salt));
-       |                  ^~~~~
- crypt_stubs.c:14:18: error: initialization of 'char *' from 'int' makes pointer from integer without a cast [-Wint-conversion]
- crypt_stubs.c: In function 'crypt_md5':
- crypt_stubs.c:43:12: error: assignment to 'char *' from 'int' makes pointer from integer without a cast [-Wint-conversion]
-    43 |   password = crypt(String_val(key), salt);
-       |            ^
- make[2]: *** [/home/opam/.opam/default/lib/ocaml-makefile/OCamlMakefile:1132: crypt_stubs.o] Error 2
- make[2]: Leaving directory '/home/opam/.opam/default/.opam-switch/build/crypt.1.2/lib'
- make[1]: *** [/home/opam/.opam/default/lib/ocaml-makefile/OCamlMakefile:801: native-code-library] Error 2
- make[1]: Leaving directory '/home/opam/.opam/default/.opam-switch/build/crypt.1.2/lib'
- make: *** [Makefile:2: all] Error 2
[ERROR] The compilation of crypt.1.2 failed at "make".
build failed... 

=== STDERR ===

2026-10-23 20:29.29: FAILED: build crypt.1.2
2026-10-23 20:29.29: Job failed: build failed: crypt.1.2