Build:
  1. 0
2026-10-23 20:25.33: New job: build camlgpc.1.0 (7fa9830cb5a6)
2026-10-23 20:25.33: Waiting for resource in pool day11-builds
2026-10-23 20:28.45: Got resource from pool day11-builds
2026-10-23 20:28.45: [profile full] build camlgpc.1.0
2026-10-23 20:28.45: build camlgpc.1.0 (7fa9830cb5a6)
=== DEPENDENCIES (5 transitive) ===
  compiler-cloning.enabled                           1aa529c962c5
  ocaml.5.5.2                                        3d66d99b0b38
  ocaml-base-compiler.5.5.2                          546a7f1026cd
  ocaml-compiler.5.5.2                               956e368db607
  ocamlfind.1.9.9~preview                            36cecca1627b
=== STDOUT ===
Processing: [default: loading data]
[camlgpc.1.0: dl]
[camlgpc.1.0: extract]
-> retrieved camlgpc.1.0  (https://opam.ocaml.org/cache)
[camlgpc: make]
+ /usr/bin/make  (CWD=/home/opam/.opam/default/.opam-switch/build/camlgpc.1.0)
- make[1]: Entering directory '/home/opam/.opam/default/.opam-switch/build/camlgpc.1.0'
- ocamlc -c -cc "cc" -ccopt "-fPIC  \
- 			-DPIC -DNATIVE_CODE   \
- 			    -o gpc.o " gpc.c 
- ocamlc -c -cc "cc" -ccopt "-fPIC  \
- 			-DPIC -DNATIVE_CODE   \
- 			    -o gpcml.o " gpcml.c 
- gpcml.c: In function 'gpcml_buildpolygon':
- gpcml.c:31:9: error: implicit declaration of function 'alloc_custom'; did you mean 'caml_alloc_custom'? [-Wimplicit-function-declaration]
-    31 |   cst = alloc_custom(&polygon_ops, sizeof(gpc_polygon*), 0, 1);
-       |         ^~~~~~~~~~~~
-       |         caml_alloc_custom
- gpcml.c: In function 'gpcml_getpolygon':
- gpcml.c:58:9: error: implicit declaration of function 'alloc_tuple'; did you mean 'caml_alloc_tuple'? [-Wimplicit-function-declaration]
-    58 |   mlp = alloc_tuple(3);
-       |         ^~~~~~~~~~~
-       |         caml_alloc_tuple
- gpcml.c:67:13: error: implicit declaration of function 'alloc'; did you mean 'valloc'? [-Wimplicit-function-declaration]
-    67 |     holes = alloc(p->num_contours, 0);
-       |             ^~~~~
-       |             valloc
- make[1]: *** [OCamlMakefile:1013: gpcml.o] Error 2
- make[1]: Leaving directory '/home/opam/.opam/default/.opam-switch/build/camlgpc.1.0'
- make: *** [OCamlMakefile:725: native-code-library] Error 2
[ERROR] The compilation of camlgpc.1.0 failed at "make".
build failed... 

=== STDERR ===

2026-10-23 20:28.59: FAILED: build camlgpc.1.0
2026-10-23 20:28.59: Job failed: build failed: camlgpc.1.0