Build:
  1. 0
2026-10-23 20:25.03: New job: build conf-cuda.1 (f554baee6ff8)
2026-10-23 20:25.03: Waiting for resource in pool day11-builds
2026-10-23 20:25.41: Got resource from pool day11-builds
2026-10-23 20:25.41: [profile full] build conf-cuda.1
2026-10-23 20:25.41: build conf-cuda.1 (f554baee6ff8)
=== DEPENDENCIES (5 transitive) ===
  compiler-cloning.enabled                           1aa529c962c5
  conf-cuda-config.1                                 16f0f2d3f94e
  ocaml.5.5.2                                        3d66d99b0b38
  ocaml-base-compiler.5.5.2                          546a7f1026cd
  ocaml-compiler.5.5.2                               956e368db607
=== STDOUT ===
Processing: [default: loading data]
[conf-cuda: sh cat <<EOF > test.c
   #include  "cuda.h"
   #include  "nvrtc.h"
   ]
+ /usr/bin/sh "-exc" "cat <<EOF > test.c\n   #include  \"cuda.h\"\n   #include  \"nvrtc.h\"\n   " (CWD=/home/opam/.opam/default/.opam-switch/build/conf-cuda.1)
- + cat
[conf-cuda: sh]
+ /usr/bin/sh "-exc" "$(ocamlc -config-var c_compiler) -c $CFLAGS -I'/usr/local/cuda/include' test.c" (CWD=/home/opam/.opam/default/.opam-switch/build/conf-cuda.1)
- + ocamlc -config-var c_compiler
- + gcc -c -I/usr/local/cuda/include test.c
- test.c:1:14: fatal error: cuda.h: No such file or directory
-     1 |    #include  "cuda.h"
-       |              ^~~~~~~~
- compilation terminated.
[ERROR] The compilation of conf-cuda.1 failed at "sh -exc $(ocamlc -config-var c_compiler) -c $CFLAGS -I'/usr/local/cuda/include' test.c".
build failed... 

=== STDERR ===

2026-10-23 20:25.52: FAILED: build conf-cuda.1
2026-10-23 20:25.52: Job failed: build failed: conf-cuda.1