Build:
- 0
2026-10-22 13:49.03: New job: build async_ssl.v0.13.0 (7c2c2f577c5b)
2026-10-22 13:49.03: Waiting for resource in pool day11-builds
2026-10-22 14:54.38: Got resource from pool day11-builds
2026-10-22 14:54.38: [profile full] build async_ssl.v0.13.0
2026-10-22 14:54.38: build async_ssl.v0.13.0 (7c2c2f577c5b)
=== DEPENDENCIES (78 transitive) ===
async.v0.13.0 458897cdb8f5
async_kernel.v0.13.0 0ce7d257a24a
async_rpc_kernel.v0.13.0 0e8d193766b3
async_unix.v0.13.1 148d99ce0bea
base.v0.13.2 fb54b6d88e91
base-threads.base ca51096a9c5b
base-unix.base 88a83b7ed333
base_bigstring.v0.13.0 8268210cf1a6
base_quickcheck.v0.13.0 6f3b93bf4fe2
bin_prot.v0.13.0 28945da869af
conf-libffi.2.0.0 13818097de30
conf-libssl.4 9a6f007648db
conf-pkg-config.5 26be2768a637
core.v0.13.0 c203c8011685
core_kernel.v0.13.1 27faa2849931
csexp.1.5.2 d71afead8f90
ctypes.0.17.1 aef428598454
ctypes-foreign.0.18.0 615fd647f05c
dune.3.24.2 de25fed135e6
dune-configurator.3.22.2 72664a7570a7
fieldslib.v0.13.0 e5ea573c9a56
integers.0.8.0 5327eb98deae
jane-street-headers.v0.13.0 5504c1042b1b
jst-config.v0.13.0 ee055146225c
num.1.6 6492981a3f8a
ocaml.4.11.2 be3bce46f1e4
ocaml-base-compiler.4.11.2 0b67d928ba9b
ocaml-compiler-libs.v0.12.4 fbe5f7b98f58
ocaml-config.1 fec73e7949c0
ocaml-migrate-parsetree.1.8.0 ad0f97dd3586
ocaml-secondary-compiler.4.14.2 ad00659de5da
ocamlfind.1.9.6 dfae6a11d0ab
ocamlfind-secondary.1.9.6 8292049889c3
octavius.1.2.2 6c6e0b56619c
parsexp.v0.13.0 0d56ba9a8e36
ppx_assert.v0.13.0 cdf28d347e06
ppx_base.v0.13.0 277f91d0abb9
ppx_bench.v0.13.0 4177e1df3fe0
ppx_bin_prot.v0.13.0 7546012f3b9e
ppx_cold.v0.13.0 c8a410c3c019
ppx_compare.v0.13.0 b07042a5ab98
ppx_custom_printf.v0.13.0 7f78a6780cc8
ppx_derivers.1.2.1 3e5a19351ab2
ppx_enumerate.v0.13.0 4dbe46c46221
ppx_expect.v0.13.1 cee25b3ff3ff
ppx_fail.v0.13.0 761701746841
ppx_fields_conv.v0.13.0 543ab78579d9
ppx_hash.v0.13.0 cba8640fd078
ppx_here.v0.13.0 012f0f44bfbd
ppx_inline_test.v0.13.1 c918ae4072dd
ppx_jane.v0.13.0 fcb2eacca9c2
ppx_js_style.v0.13.0 0be9b2e9ab54
ppx_let.v0.13.0 e341083f9cec
ppx_module_timer.v0.13.0 22c7e0ebde2f
ppx_optcomp.v0.13.0 7e397ec40715
ppx_optional.v0.13.0 90dda4ca23d1
ppx_pipebang.v0.13.0 e3f527c8fa9f
ppx_sexp_conv.v0.13.0 c78dc25fc0d1
ppx_sexp_message.v0.13.0 9e1d894f4b50
ppx_sexp_value.v0.13.0 e82c6119cbd6
ppx_stable.v0.13.0 af338d6b8214
ppx_typerep_conv.v0.13.0 63c777cf1921
ppx_variants_conv.v0.13.0 993a68d2d7b6
ppxlib.0.13.0 8f0e3bd0dcc4
protocol_version_header.v0.13.0 06f191231df2
re.1.11.0 f75f1fc03b59
result.1.5 e900a0d6ca9c
seq.base c8f0474d8ec8
sexplib.v0.13.0 e5520f227f27
sexplib0.v0.13.0 6e64495ba429
spawn.v0.17.0 4ef0b8df024f
splittable_random.v0.13.0 4e19b9033735
stdio.v0.13.0 507f0ffe2a7c
stdlib-shims.0.3.0 d5866b9bc657
textutils.v0.13.0 5d7bb9ac4acd
time_now.v0.13.0 f13170286120
typerep.v0.13.0 a7d57b094c42
variantslib.v0.13.0 4c278bd31843
=== STDOUT ===
Processing: [default: loading data]
[async_ssl.v0.13.0: dl]
[async_ssl.v0.13.0: extract]
-> retrieved async_ssl.v0.13.0 (https://opam.ocaml.org/cache)
[async_ssl: dune build]
+ /home/opam/.opam/default/bin/dune "build" "-p" "async_ssl" "-j" "39" (CWD=/home/opam/.opam/default/.opam-switch/build/async_ssl.v0.13.0)
- (cd _build/default/bindings && /usr/bin/gcc -O2 -fno-strict-aliasing -fwrapv -fPIC -D_FILE_OFFSET_BITS=64 -D_REENTRANT -O2 -fno-strict-aliasing -fwrapv -fPIC -g -I /home/opam/.opam/default/lib/ocaml -I /home/opam/.opam/default/lib/base -I /home/opam/.opam/default/lib/base/base_internalhash_types -I /home/opam/.opam/default/lib/base/caml -I /home/opam/.opam/default/lib/base/md5 -I /home/opam/.opam/default/lib/base/shadow_stdlib -I /home/opam/.opam/default/lib/base_quickcheck -I /home/opam/.opam/default/lib/bin_prot -I /home/opam/.opam/default/lib/bin_prot/shape -I /home/opam/.opam/default/lib/bytes -I /home/opam/.opam/default/lib/ctypes -I /home/opam/.opam/default/lib/fieldslib -I /home/opam/.opam/default/lib/integers -I /home/opam/.opam/default/lib/jane-street-headers -I /home/opam/.opam/default/lib/ocaml/threads -I /home/opam/.opam/default/lib/ppx_assert/runtime-lib -I /home/opam/.opam/default/lib/ppx_bench/runtime-lib -I /home/opam/.opam/default/lib/ppx_compare/runtime-lib -I /home/opam/.opam/default/lib/ppx_enumerate/runtime-lib -I /home/opam/.opam/default/lib/ppx_expect/collector -I /home/opam/.opam/default/lib/ppx_expect/common -I /home/opam/.opam/default/lib/ppx_expect/config -I /home/opam/.opam/default/lib/ppx_hash/runtime-lib -I /home/opam/.opam/default/lib/ppx_here/runtime-lib -I /home/opam/.opam/default/lib/ppx_inline_test/config -I /home/opam/.opam/default/lib/ppx_inline_test/runtime-lib -I /home/opam/.opam/default/lib/ppx_module_timer/runtime -I /home/opam/.opam/default/lib/ppx_sexp_conv/runtime-lib -I /home/opam/.opam/default/lib/sexplib0 -I /home/opam/.opam/default/lib/splittable_random -I /home/opam/.opam/default/lib/stdio -I /home/opam/.opam/default/lib/stdlib-shims -I /home/opam/.opam/default/lib/time_now -I /home/opam/.opam/default/lib/typerep -I /home/opam/.opam/default/lib/variantslib -o openssl_helpers.o -c openssl_helpers.c)
- openssl_helpers.c: In function 'async_ssl__subject_alt_names':
- openssl_helpers.c:66:9: warning: 'ASN1_STRING_data' is deprecated: Since OpenSSL 1.1.0 [-Wdeprecated-declarations]
- 66 | cstr = ASN1_STRING_data(gen->d.dNSName);
- | ^~~~
- In file included from /usr/include/openssl/objects.h:21,
- from /usr/include/openssl/evp.h:47,
- from /usr/include/openssl/x509.h:31,
- from /usr/include/openssl/x509v3.h:27,
- from openssl_helpers.c:2:
- /usr/include/openssl/asn1.h:671:40: note: declared here
- 671 | OSSL_DEPRECATEDIN_1_1_0 unsigned char *ASN1_STRING_data(ASN1_STRING *x);
- | ^~~~~~~~~~~~~~~~
- File "src/dune", line 16, characters 10-29:
- 16 | (c_names ffi_generated_stubs) (flags :standard -w -9-27-32-34)
- ^^^^^^^^^^^^^^^^^^^
- (cd _build/default/src && /usr/bin/gcc -O2 -fno-strict-aliasing -fwrapv -fPIC -D_FILE_OFFSET_BITS=64 -D_REENTRANT -O2 -fno-strict-aliasing -fwrapv -fPIC -w -g -I /home/opam/.opam/default/lib/ocaml -I /home/opam/.opam/default/lib/async -I /home/opam/.opam/default/lib/async/async_command -I /home/opam/.opam/default/lib/async/async_quickcheck -I /home/opam/.opam/default/lib/async/async_rpc -I /home/opam/.opam/default/lib/async_kernel -I /home/opam/.opam/default/lib/async_kernel/persistent_connection_kernel -I /home/opam/.opam/default/lib/async_rpc_kernel -I /home/opam/.opam/default/lib/async_unix -I /home/opam/.opam/default/lib/async_unix/thread_pool -I /home/opam/.opam/default/lib/async_unix/thread_safe_ivar -I /home/opam/.opam/default/lib/base -I /home/opam/.opam/default/lib/base/base_internalhash_types -I /home/opam/.opam/default/lib/base/caml -I /home/opam/.opam/default/lib/base/md5 -I /home/opam/.opam/default/lib/base/shadow_stdlib -I /home/opam/.opam/default/lib/base_bigstring -I /home/opam/.opam/default/lib/base_quickcheck -I /home/opam/.opam/default/lib/bin_prot -I /home/opam/.opam/default/lib/bin_prot/shape -I /home/opam/.opam/default/lib/bytes -I /home/opam/.opam/default/lib/core -I /home/opam/.opam/default/lib/core/error_checking_mutex -I /home/opam/.opam/default/lib/core/nano_mutex -I /home/opam/.opam/default/lib/core/squeue -I /home/opam/.opam/default/lib/core/time_stamp_counter -I /home/opam/.opam/default/lib/core/uuid -I /home/opam/.opam/default/lib/core_kernel -I /home/opam/.opam/default/lib/core_kernel/base_for_tests -I /home/opam/.opam/default/lib/core_kernel/bounded_int_table -I /home/opam/.opam/default/lib/core_kernel/flags -I /home/opam/.opam/default/lib/core_kernel/moption -I /home/opam/.opam/default/lib/core_kernel/pairing_heap -I /home/opam/.opam/default/lib/core_kernel/thread_pool_cpu_affinity -I /home/opam/.opam/default/lib/core_kernel/thread_safe_queue -I /home/opam/.opam/default/lib/core_kernel/timing_wheel -I /home/opam/.opam/default/lib/core_kernel/tuple_pool -I /home/opam/.opam/default/lib/core_kernel/uopt -I /home/opam/.opam/default/lib/core_kernel/uuid -I /home/opam/.opam/default/lib/core_kernel/version_util -I /home/opam/.opam/default/lib/ctypes -I /home/opam/.opam/default/lib/fieldslib -I /home/opam/.opam/default/lib/integers -I /home/opam/.opam/default/lib/jane-street-headers -I /home/opam/.opam/default/lib/ocaml/threads -I /home/opam/.opam/default/lib/parsexp -I /home/opam/.opam/default/lib/ppx_assert/runtime-lib -I /home/opam/.opam/default/lib/ppx_bench/runtime-lib -I /home/opam/.opam/default/lib/ppx_compare/runtime-lib -I /home/opam/.opam/default/lib/ppx_enumerate/runtime-lib -I /home/opam/.opam/default/lib/ppx_expect/collector -I /home/opam/.opam/default/lib/ppx_expect/common -I /home/opam/.opam/default/lib/ppx_expect/config -I /home/opam/.opam/default/lib/ppx_hash/runtime-lib -I /home/opam/.opam/default/lib/ppx_here/runtime-lib -I /home/opam/.opam/default/lib/ppx_inline_test/config -I /home/opam/.opam/default/lib/ppx_inline_test/runtime-lib -I /home/opam/.opam/default/lib/ppx_module_timer/runtime -I /home/opam/.opam/default/lib/ppx_sexp_conv/runtime-lib -I /home/opam/.opam/default/lib/protocol_version_header -I /home/opam/.opam/default/lib/sexplib -I /home/opam/.opam/default/lib/sexplib/unix -I /home/opam/.opam/default/lib/sexplib0 -I /home/opam/.opam/default/lib/spawn -I /home/opam/.opam/default/lib/splittable_random -I /home/opam/.opam/default/lib/stdio -I /home/opam/.opam/default/lib/stdlib-shims -I /home/opam/.opam/default/lib/time_now -I /home/opam/.opam/default/lib/typerep -I /home/opam/.opam/default/lib/variantslib -I ../bindings -o ffi_generated_stubs.o -c ffi_generated_stubs.c)
- ffi_generated_stubs.c: In function 'async_ssl_stub_14_ENGINE_load_builtin_engines':
- ffi_generated_stubs.c:80:4: error: implicit declaration of function 'ENGINE_load_builtin_engines' [-Wimplicit-function-declaration]
- 80 | ENGINE_load_builtin_engines();
- | ^~~~~~~~~~~~~~~~~~~~~~~~~~~
- ffi_generated_stubs.c: In function 'async_ssl_stub_15_ENGINE_unregister_RAND':
- ffi_generated_stubs.c:85:4: error: implicit declaration of function 'ENGINE_unregister_RAND' [-Wimplicit-function-declaration]
- 85 | ENGINE_unregister_RAND();
- | ^~~~~~~~~~~~~~~~~~~~~~
- ffi_generated_stubs.c: In function 'async_ssl_stub_16_ENGINE_register_all_complete':
- ffi_generated_stubs.c:90:4: error: implicit declaration of function 'ENGINE_register_all_complete' [-Wimplicit-function-declaration]
- 90 | ENGINE_register_all_complete();
- | ^~~~~~~~~~~~~~~~~~~~~~~~~~~~
- ffi_generated_stubs.c: In function 'async_ssl_stub_47_BN_hex2bn':
- ffi_generated_stubs.c:289:25: error: passing argument 1 of 'BN_hex2bn' from incompatible pointer type [-Wincompatible-pointer-types]
- 289 | int x176 = BN_hex2bn(x174, x175);
- | ^~~~
- | |
- | void **
- In file included from /usr/include/openssl/params.h:16,
- from /usr/include/openssl/indicator.h:18,
- from /usr/include/openssl/core_dispatch.h:16,
- from /usr/include/openssl/evp.h:28,
- from /usr/include/openssl/x509.h:31,
- from /usr/include/openssl/ssl.h:34,
- from ffi_generated_stubs.c:2:
- /usr/include/openssl/bn.h:345:24: note: expected 'BIGNUM **' {aka 'struct bignum_st **'} but argument is of type 'void **'
- 345 | int BN_hex2bn(BIGNUM **a, const char *str);
- | ~~~~~~~~~^
- ffi_generated_stubs.c: In function 'async_ssl_stub_71_SSL_set_tmp_dh_callback':
- ffi_generated_stubs.c:459:34: error: passing argument 2 of 'SSL_set_tmp_dh_callback' from incompatible pointer type [-Wincompatible-pointer-types]
- 459 | SSL_set_tmp_dh_callback(x315, x316);
- | ^~~~
- | |
- | void * (*)(void *, _Bool, int)
- /usr/include/openssl/ssl.h:2282:11: note: expected 'DH * (*)(SSL *, int, int)' {aka 'struct dh_st * (*)(struct ssl_st *, int, int)'} but argument is of type 'void * (*)(void *, _Bool, int)'
- 2282 | DH *(*dh)(SSL *ssl, int is_export,
- | ~~~~~~^~~~~~~~~~~~~~~~~~~~~~~~~~~~
- 2283 | int keylength));
- | ~~~~~~~~~~~~~~
[ERROR] The compilation of async_ssl.v0.13.0 failed at "dune build -p async_ssl -j 39".
build failed...
=== STDERR ===
2026-10-22 14:55.09: FAILED: build async_ssl.v0.13.0
2026-10-22 14:55.09: Job failed: build failed: async_ssl.v0.13.0