Build:
  1. 0
2026-10-22 04:33.09: New job: build key-parsers.0.9.2 (ae9e3ad3f866)
2026-10-22 04:33.09: Waiting for resource in pool day11-builds
2026-10-22 05:43.14: Got resource from pool day11-builds
2026-10-22 05:43.14: [profile full] build key-parsers.0.9.2
2026-10-22 05:43.14: build key-parsers.0.9.2 (ae9e3ad3f866)
=== DEPENDENCIES (45 transitive) ===
  asn1-combinators.0.2.5                             ad2139774dd0
  base.v0.14.4                                       e9aa81663401
  base-threads.base                                  ca51096a9c5b
  base-unix.base                                     88a83b7ed333
  bigarray-compat.1.1.0                              410d6549a035
  bin_prot.v0.14.1                                   3766f7434540
  conf-gmp.5                                         d0211a82c71f
  conf-pkg-config.5                                  26be2768a637
  cppo.1.8.0                                         6cd392a42ba4
  csexp.1.5.2                                        0ca49e9e1451
  cstruct.5.2.0                                      3c7a61056ea3
  dune.3.22.2                                        706d6641ae15
  dune-configurator.3.22.2                           a2543320b82c
  fieldslib.v0.14.0                                  a4bf7a1881b1
  hex.1.5.0                                          084ad7f6b669
  ocaml.4.12.1                                       9f11d68ab027
  ocaml-base-compiler.4.12.1                         f3fe6b0ae528
  ocaml-compiler-libs.v0.12.4                        15389b515629
  ocaml-config.2                                     51cd011547ac
  ocaml-migrate-parsetree.1.8.0                      6523795f2510
  ocamlbuild.0.16.1                                  4ee5ccc4f975
  ocamlfind.1.9.8                                    ca20b5ce2716
  ppx_bin_prot.v0.14.0                               1e98a2b1a31e
  ppx_compare.v0.14.0                                eee64210a11d
  ppx_custom_printf.v0.14.0                          86d45fc270df
  ppx_derivers.1.2.1                                 e73d6de78663
  ppx_deriving.4.5-1                                 696e93ab4459
  ppx_deriving_yojson.3.5.3                          9a22214bc67d
  ppx_fields_conv.v0.14.1                            37ce9d5ff57d
  ppx_here.v0.14.0                                   2c341dee7ce7
  ppx_optcomp.v0.14.0                                ff42f4bd01c1
  ppx_sexp_conv.v0.14.1                              dbe0f590d042
  ppx_tools.6.6                                      e92916eb29a0
  ppx_variants_conv.v0.14.1                          25d376cc3d05
  ppxfind.1.4                                        778b55a99e31
  ppxlib.0.15.0                                      f02ad4299b6d
  ptime.0.8.5                                        c6c8accacb58
  result.1.5                                         0282b1c20a70
  sexplib0.v0.14.0                                   af98d90547af
  stdio.v0.14.0                                      2ea2ba0be6bd
  stdlib-shims.0.3.0                                 596f4dee9caa
  topkg.1.1.1                                        9d4e3bef4d69
  variantslib.v0.14.0                                20d4bf94a573
  yojson.3.0.0                                       cddba1b79b26
  zarith.1.14                                        fe04da1a29b9
=== STDOUT ===
Processing: [default: loading data]
[key-parsers.0.9.2: dl]
[key-parsers.0.9.2: extract]
-> retrieved key-parsers.0.9.2  (https://opam.ocaml.org/cache)
[key-parsers: ocaml build]
+ /home/opam/.opam/default/bin/ocaml "pkg/pkg.ml" "build" "--pinned" "false" (CWD=/home/opam/.opam/default/.opam-switch/build/key-parsers.0.9.2)
- + ocamlfind ocamlc -config
- + ocamlfind ocamldep -package ppx_deriving_yojson -package ppx_bin_prot -package zarith -package str -package result -package ppx_deriving -package ppx_deriving.std -package ppx_deriving_yojson.runtime -package hex -package bin_prot -package asn1-combinators -modules src/kp_asn1.ml > src/kp_asn1.ml.depends
- + ocamlfind ocamldep -package ppx_deriving_yojson -package ppx_bin_prot -package zarith -package str -package result -package ppx_deriving -package ppx_deriving.std -package ppx_deriving_yojson.runtime -package hex -package bin_prot -package asn1-combinators -modules src/kp_derivable.mli > src/kp_derivable.mli.depends
- + ocamlfind ocamlc -c -g -bin-annot -safe-string -package ppx_deriving_yojson -package ppx_bin_prot -package zarith -package str -package result -package ppx_deriving -package ppx_deriving.std -package ppx_deriving_yojson.runtime -package hex -package bin_prot -package asn1-combinators -I src -o src/kp_derivable.cmi src/kp_derivable.mli
- + ocamlfind ocamlc -c -g -bin-annot -safe-string -package ppx_deriving_yojson -package ppx_bin_prot -package zarith -package str -package result -package ppx_deriving -package ppx_deriving.std -package ppx_deriving_yojson.runtime -package hex -package bin_prot -package asn1-combinators -I src -o src/kp_derivable.cmi src/kp_derivable.mli
- File "src/kp_derivable.mli", line 15, characters 23-39:
- 15 |   val to_yojson : t -> Yojson.Safe.json
-                             ^^^^^^^^^^^^^^^^
- Error: Unbound type constructor Yojson.Safe.json
- Command exited with code 2.
- pkg.ml: [ERROR] cmd ['ocamlbuild' '-use-ocamlfind' '-classic-display' '-j' '4' '-tag' 'debug'
-      '-build-dir' '_build' 'pkg.otarget']: exited with 10
[ERROR] The compilation of key-parsers.0.9.2 failed at "ocaml pkg/pkg.ml build --pinned false".
build failed... 

=== STDERR ===

2026-10-22 05:44.20: FAILED: build key-parsers.0.9.2
2026-10-22 05:44.20: Job failed: build failed: key-parsers.0.9.2