Build:
  1. 0
2026-10-22 03:38.00: New job: build gluon.0.0.8 (de614baa2f67)
2026-10-22 03:38.00: Waiting for resource in pool day11-builds
2026-10-22 05:25.52: Got resource from pool day11-builds
2026-10-22 05:25.52: [profile full] build gluon.0.0.8
2026-10-22 05:25.52: build gluon.0.0.8 (de614baa2f67)
=== DEPENDENCIES (35 transitive) ===
  angstrom.0.16.1                                    73bea429193d
  base-threads.base                                  ca51096a9c5b
  base-unix.base                                     88a83b7ed333
  bigstringaf.0.10.0                                 0710691a291c
  bytestring.0.0.8                                   182f3693cbd9
  colors.0.0.1                                       4ff9aad08ef6
  config.0.0.3                                       95904f3741f5
  csexp.1.5.2                                        7d6b0fd3bf78
  cstruct.6.3.0                                      6c641d98e872
  dune.3.24.2                                        e0572fcd3a5c
  dune-configurator.3.24.2                           3a1922f062bb
  fmt.0.11.0                                         6a4b1f98b2b3
  gen.1.1                                            ab9014a67292
  libc.0.0.1                                         8f272a44a986
  ocaml.5.3.0                                        92450889936d
  ocaml-base-compiler.5.3.0                          cdfe4719bb80
  ocaml-compiler.5.3.0                               c2fd8a2e2b36
  ocaml-compiler-libs.v0.17.0                        4bf56a360a8f
  ocaml-config.3                                     8168bc07a451
  ocaml-syntax-shims.1.0.0                           e8bf8e06f6b0
  ocamlbuild.0.16.1                                  62fb1a194cf7
  ocamlfind.1.9.8                                    3f8ff7716be7
  ppx_derivers.1.2.1                                 816724a5a727
  ppxlib.0.35.0                                      48ff0cc03858
  rio.0.0.8                                          462f5794592a
  sedlex.3.8.1                                       a85d84a1a39e
  seq.base                                           5d1f26dc9dba
  sexplib0.v0.17.0                                   4722c993ecfd
  spices.0.0.2                                       80970ff847a2
  stdlib-shims.0.3.0                                 5f888484bdf1
  stringext.1.6.0                                    137327c98c4a
  topkg.1.1.1                                        f53d1edc1273
  tty.0.0.2                                          9119adb436c3
  uri.4.4.0                                          37843c810f56
  uutf.1.0.4                                         fc8e34dc845a
=== STDOUT ===
Processing: [default: loading data]
[gluon.0.0.8: extract]
-> retrieved gluon.0.0.8  (cached)
[gluon: dune build]
+ /home/opam/.opam/default/bin/dune "build" "-p" "gluon" "-j" "39" "@install" (CWD=/home/opam/.opam/default/.opam-switch/build/gluon.0.0.8)
- File "gluon/sys/unix/dune", line 11, characters 41-57:
- 11 |   (names gluon_unix_io gluon_unix_kqueue gluon_unix_epoll)
-                                               ^^^^^^^^^^^^^^^^
- (cd _build/default/gluon/sys/unix && /usr/bin/gcc -O2 -fno-strict-aliasing -fwrapv -fPIC -pthread -D_FILE_OFFSET_BITS=64 -Wall -fdiagnostics-color=always -O2 -g -I /home/opam/.opam/default/lib/ocaml -I /home/opam/.opam/default/lib/libc -I /home/opam/.opam/default/lib/ocaml/unix -I ../../common -I ../../events -o gluon_unix_epoll.o -c gluon_unix_epoll.c)
- gluon_unix_epoll.c: In function 'gluon_unix_epoll_wait':
- gluon_unix_epoll.c:52:38: error: passing argument 1 of 'caml_alloc_array' from incompatible pointer type [-Wincompatible-pointer-types]
-    52 |       event_array = caml_alloc_array(epoll_event_to_record, event_ptrs);
-       |                                      ^~~~~~~~~~~~~~~~~~~~~
-       |                                      |
-       |                                      value (*)(struct epoll_event *) {aka long int (*)(struct epoll_event *)}
- In file included from gluon_unix_epoll.c:3:
- /home/opam/.opam/default/lib/ocaml/caml/alloc.h:56:44: note: expected 'value (*)(const char *)' {aka 'long int (*)(const char *)'} but argument is of type 'value (*)(struct epoll_event *)' {aka 'long int (*)(struct epoll_event *)'}
-    56 | CAMLextern value caml_alloc_array (value (*funct) (char const *),
-       |                                    ~~~~~~~~^~~~~~~~~~~~~~~~~~~~~
- gluon_unix_epoll.c:52:61: error: passing argument 2 of 'caml_alloc_array' from incompatible pointer type [-Wincompatible-pointer-types]
-    52 |       event_array = caml_alloc_array(epoll_event_to_record, event_ptrs);
-       |                                                             ^~~~~~~~~~
-       |                                                             |
-       |                                                             struct epoll_event **
- /home/opam/.opam/default/lib/ocaml/caml/alloc.h:57:57: note: expected 'const char * const*' but argument is of type 'struct epoll_event **'
-    57 |                                    char const * const * array);
-       |                                    ~~~~~~~~~~~~~~~~~~~~~^~~~~
- gluon_unix_epoll.c: In function 'gluon_unix_epoll_ctl':
- gluon_unix_epoll.c:72:20: error: assignment to 'uint64_t' {aka 'long unsigned int'} from 'value *' {aka 'long int *'} makes integer from pointer without a cast [-Wint-conversion]
-    72 |     event.data.u64 = ocaml_value;
-       |                    ^
[ERROR] The compilation of gluon.0.0.8 failed at "dune build -p gluon -j 39 @install".
build failed... 

=== STDERR ===

2026-10-22 05:26.04: FAILED: build gluon.0.0.8
2026-10-22 05:26.04: Job failed: build failed: gluon.0.0.8