Build:
  1. 1
  2. 0
2026-10-22 02:38.11: New job: build gluon.0.0.8 (dc4a74a1eed6)
2026-10-22 02:38.11: Waiting for resource in pool day11-builds
2026-10-22 04:26.53: Got resource from pool day11-builds
2026-10-22 04:26.53: [profile full] build gluon.0.0.8
2026-10-22 04:26.53: build gluon.0.0.8 (dc4a74a1eed6)
=== DEPENDENCIES (34 transitive) ===
  angstrom.0.16.1                                    4ae0b0fa918f
  base-threads.base                                  ca51096a9c5b
  base-unix.base                                     88a83b7ed333
  bigstringaf.0.10.0                                 d55140aa331e
  bytestring.0.0.8                                   267c11bf45b3
  colors.0.0.1                                       361c76fca022
  config.0.0.3                                       f9b0e1806649
  csexp.1.5.2                                        cf66de86e9ce
  cstruct.6.3.0                                      9d03ca9257fa
  dune.3.24.2                                        7519a4549be9
  dune-configurator.3.24.2                           c3a8a7654795
  fmt.0.11.0                                         c11169ab7de9
  gen.1.1                                            333392290390
  libc.0.0.1                                         20e648fba2c5
  ocaml.5.2.1                                        2d686c4b1c5c
  ocaml-base-compiler.5.2.1                          d3ca04326b5c
  ocaml-compiler-libs.v0.17.0                        ddee96b6efe3
  ocaml-config.3                                     661eb037103e
  ocaml-syntax-shims.1.0.0                           07d9c6c08b86
  ocamlbuild.0.16.1                                  dd32f9b47ee8
  ocamlfind.1.9.8                                    073598b8b9bf
  ppx_derivers.1.2.1                                 6d121477b8a8
  ppxlib.0.35.0                                      aad438722066
  rio.0.0.8                                          a5ddd92f9e45
  sedlex.3.8.1                                       32afe719e0b7
  seq.base                                           4404b5bee093
  sexplib0.v0.17.0                                   d547de7785df
  spices.0.0.2                                       3e9b9302f3f5
  stdlib-shims.0.3.0                                 c9f864280571
  stringext.1.6.0                                    c742f8cb9aed
  topkg.1.1.1                                        df843f533bad
  tty.0.0.2                                          0cd2ff151dcd
  uri.4.4.0                                          4cc55f527735
  uutf.1.0.4                                         12df8379c845
=== STDOUT ===
Processing: [default: loading data]
[gluon.0.0.8: extract]
-> retrieved gluon.0.0.8  (cached)
[gluon: dune build]
+ /home/opam/.opam/default/bin/dune "build" "-p" "gluon" "-j" "39" "@install" (CWD=/home/opam/.opam/default/.opam-switch/build/gluon.0.0.8)
- File "gluon/sys/unix/dune", line 11, characters 41-57:
- 11 |   (names gluon_unix_io gluon_unix_kqueue gluon_unix_epoll)
-                                               ^^^^^^^^^^^^^^^^
- (cd _build/default/gluon/sys/unix && /usr/bin/gcc -O2 -fno-strict-aliasing -fwrapv -pthread -fPIC -pthread -D_FILE_OFFSET_BITS=64 -Wall -fdiagnostics-color=always -O2 -g -I /home/opam/.opam/default/lib/ocaml -I /home/opam/.opam/default/lib/libc -I /home/opam/.opam/default/lib/ocaml/unix -I ../../common -I ../../events -o gluon_unix_epoll.o -c gluon_unix_epoll.c)
- gluon_unix_epoll.c: In function 'gluon_unix_epoll_wait':
- gluon_unix_epoll.c:52:38: error: passing argument 1 of 'caml_alloc_array' from incompatible pointer type [-Wincompatible-pointer-types]
-    52 |       event_array = caml_alloc_array(epoll_event_to_record, event_ptrs);
-       |                                      ^~~~~~~~~~~~~~~~~~~~~
-       |                                      |
-       |                                      value (*)(struct epoll_event *) {aka long int (*)(struct epoll_event *)}
- In file included from gluon_unix_epoll.c:3:
- /home/opam/.opam/default/lib/ocaml/caml/alloc.h:57:44: note: expected 'value (*)(const char *)' {aka 'long int (*)(const char *)'} but argument is of type 'value (*)(struct epoll_event *)' {aka 'long int (*)(struct epoll_event *)'}
-    57 | CAMLextern value caml_alloc_array (value (*funct) (char const *),
-       |                                    ~~~~~~~~^~~~~~~~~~~~~~~~~~~~~
- gluon_unix_epoll.c:52:61: error: passing argument 2 of 'caml_alloc_array' from incompatible pointer type [-Wincompatible-pointer-types]
-    52 |       event_array = caml_alloc_array(epoll_event_to_record, event_ptrs);
-       |                                                             ^~~~~~~~~~
-       |                                                             |
-       |                                                             struct epoll_event **
- /home/opam/.opam/default/lib/ocaml/caml/alloc.h:58:57: note: expected 'const char * const*' but argument is of type 'struct epoll_event **'
-    58 |                                    char const * const * array);
-       |                                    ~~~~~~~~~~~~~~~~~~~~~^~~~~
- gluon_unix_epoll.c: In function 'gluon_unix_epoll_ctl':
- gluon_unix_epoll.c:72:20: error: assignment to 'uint64_t' {aka 'long unsigned int'} from 'value *' {aka 'long int *'} makes integer from pointer without a cast [-Wint-conversion]
-    72 |     event.data.u64 = ocaml_value;
-       |                    ^
[ERROR] The compilation of gluon.0.0.8 failed at "dune build -p gluon -j 39 @install".
build failed... 

=== STDERR ===

2026-10-22 04:29.14: FAILED: build gluon.0.0.8
2026-10-22 04:29.14: Job failed: build failed: gluon.0.0.8