Build:
  1. 1
  2. 0
2026-10-22 02:38.09: New job: build zxcvbn.2.3+2 (2253699ef156)
2026-10-22 02:38.09: Waiting for resource in pool day11-builds
2026-10-22 04:22.56: Got resource from pool day11-builds
2026-10-22 04:22.56: [profile full] build zxcvbn.2.3+2
2026-10-22 04:22.56: build zxcvbn.2.3+2 (2253699ef156)
=== DEPENDENCIES (16 transitive) ===
  base-threads.base                                  ca51096a9c5b
  base-unix.base                                     88a83b7ed333
  cppo.1.8.0                                         580e4961faa3
  dune.3.24.2                                        adc8534aaee3
  ocaml.4.12.1                                       9f11d68ab027
  ocaml-base-compiler.4.12.1                         f3fe6b0ae528
  ocaml-config.2                                     51cd011547ac
  ocaml-migrate-parsetree.1.8.0                      715e8cd950d1
  ocaml-secondary-compiler.4.14.2                    ad00659de5da
  ocamlfind.1.9.6                                    fb8a0e6a74c9
  ocamlfind-secondary.1.9.6                          b8c3977ad934
  ppx_derivers.1.2.1                                 bd3e6faa536c
  ppx_deriving.4.5-1                                 a41cfc2a30bf
  ppx_tools.6.6                                      6f4f35b23c4f
  ppxfind.1.4                                        f29a03138d56
  result.1.5                                         90d2f350c673
=== STDOUT ===
Processing: [default: loading data]
[zxcvbn.2.3+2: dl]
[zxcvbn.2.3+2: extract]
-> retrieved zxcvbn.2.3+2  (https://opam.ocaml.org/cache)
[zxcvbn: dune build]
+ /home/opam/.opam/default/bin/dune "build" "-p" "zxcvbn" "-j" "39" (CWD=/home/opam/.opam/default/.opam-switch/build/zxcvbn.2.3+2)
- File "src/dune", line 3, characters 24-30:
- 3 |   (c_names zxcvbn_stubs zxcvbn)
-                             ^^^^^^
- (cd _build/default/src && /usr/bin/gcc -O2 -fno-strict-aliasing -fwrapv -fPIC -D_FILE_OFFSET_BITS=64 -D_REENTRANT -O2 -fno-strict-aliasing -fwrapv -fPIC '-I .' -g -I /home/opam/.opam/default/lib/ocaml -I /home/opam/.opam/default/lib/ppx_deriving/runtime -I /home/opam/.opam/default/lib/result -o zxcvbn.o -c zxcvbn.c)
- zxcvbn.c:25:10: fatal error: zxcvbn.h: No such file or directory
-    25 | #include <zxcvbn.h>
-       |          ^~~~~~~~~~
- compilation terminated.
[ERROR] The compilation of zxcvbn.2.3+2 failed at "dune build -p zxcvbn -j 39".
build failed... 

=== STDERR ===

2026-10-22 04:23.10: FAILED: build zxcvbn.2.3+2
2026-10-22 04:23.10: Job failed: build failed: zxcvbn.2.3+2