Build:
  1. 1
  2. 0
2026-10-22 02:38.09: New job: build gluon.0.0.9 (87b87b205d7d)
2026-10-22 02:38.09: Waiting for resource in pool day11-builds
2026-10-22 04:23.09: Got resource from pool day11-builds
2026-10-22 04:23.09: [profile full] build gluon.0.0.9
2026-10-22 04:23.09: build gluon.0.0.9 (87b87b205d7d)
=== DEPENDENCIES (35 transitive) ===
  angstrom.0.16.1                                    4ae0b0fa918f
  base-threads.base                                  ca51096a9c5b
  base-unix.base                                     88a83b7ed333
  bigstringaf.0.10.0                                 d55140aa331e
  bytestring.0.0.8                                   4e344a531f1b
  cmdliner.2.1.1                                     d853c9eeb363
  colors.0.0.1                                       361c76fca022
  config.0.0.3                                       d11b60152b6a
  csexp.1.5.2                                        cf66de86e9ce
  cstruct.6.3.0                                      843f3cf1a52b
  dune.3.24.2                                        7519a4549be9
  dune-configurator.3.24.2                           c3a8a7654795
  fmt.0.11.0                                         7e5b95718df6
  gen.1.1                                            333392290390
  libc.0.0.1                                         17eb068baba8
  ocaml.5.2.1                                        2d686c4b1c5c
  ocaml-base-compiler.5.2.1                          d3ca04326b5c
  ocaml-compiler-libs.v0.17.0                        ddee96b6efe3
  ocaml-config.3                                     661eb037103e
  ocaml-syntax-shims.1.0.0                           07d9c6c08b86
  ocamlbuild.0.16.1                                  dd32f9b47ee8
  ocamlfind.1.9.8                                    073598b8b9bf
  ppx_derivers.1.2.1                                 6d121477b8a8
  ppxlib.0.35.0                                      aad438722066
  rio.0.0.8                                          15ff3cf1655c
  sedlex.3.8.1                                       32afe719e0b7
  seq.base                                           4404b5bee093
  sexplib0.v0.17.0                                   d547de7785df
  spices.0.0.2                                       3f08cff58928
  stdlib-shims.0.3.0                                 c9f864280571
  stringext.1.6.0                                    c742f8cb9aed
  topkg.1.1.1                                        df843f533bad
  tty.0.0.2                                          e01a1563bad5
  uri.4.4.0                                          4cc55f527735
  uutf.1.0.4                                         f3393edce491
=== STDOUT ===
Processing: [default: loading data]
[gluon.0.0.9: dl]
[gluon.0.0.9: extract]
-> retrieved gluon.0.0.9  (https://opam.ocaml.org/cache)
[gluon: dune build]
+ /home/opam/.opam/default/bin/dune "build" "-p" "gluon" "-j" "39" "@install" (CWD=/home/opam/.opam/default/.opam-switch/build/gluon.0.0.9)
- File "gluon/sys/unix/dune", line 11, characters 41-57:
- 11 |   (names gluon_unix_io gluon_unix_kqueue gluon_unix_epoll)
-                                               ^^^^^^^^^^^^^^^^
- (cd _build/default/gluon/sys/unix && /usr/bin/gcc -O2 -fno-strict-aliasing -fwrapv -pthread -fPIC -pthread -D_FILE_OFFSET_BITS=64 -Wall -fdiagnostics-color=always -O2 -g -I /home/opam/.opam/default/lib/ocaml -I /home/opam/.opam/default/lib/libc -I /home/opam/.opam/default/lib/ocaml/unix -I ../../common -I ../../events -o gluon_unix_epoll.o -c gluon_unix_epoll.c)
- gluon_unix_epoll.c: In function 'gluon_unix_epoll_ctl':
- gluon_unix_epoll.c:73:20: error: assignment to 'uint64_t' {aka 'long unsigned int'} from 'value *' {aka 'long int *'} makes integer from pointer without a cast [-Wint-conversion]
-    73 |     event.data.u64 = ocaml_value;
-       |                    ^
[ERROR] The compilation of gluon.0.0.9 failed at "dune build -p gluon -j 39 @install".
build failed... 

=== STDERR ===

2026-10-22 04:23.45: FAILED: build gluon.0.0.9
2026-10-22 04:23.45: Job failed: build failed: gluon.0.0.9