Build:
  1. 1
  2. 0
2026-10-22 02:01.32: New job: build vhdlib.0.9.1 (c8cdab3e485d)
2026-10-22 02:01.32: Waiting for resource in pool day11-builds
2026-10-22 04:00.07: Got resource from pool day11-builds
2026-10-22 04:00.07: [profile full] build vhdlib.0.9.1
2026-10-22 04:00.07: build vhdlib.0.9.1 (c8cdab3e485d)
=== DEPENDENCIES (31 transitive) ===
  base-bytes.base                                    118af4a2ee78
  base-threads.base                                  ca51096a9c5b
  base-unix.base                                     88a83b7ed333
  base64.3.5.2                                       b625da0206ff
  cmdliner.2.1.1                                     9a9909654929
  cppo.1.8.0                                         5989590e58d8
  csexp.1.5.2                                        7d6b0fd3bf78
  dune.3.24.2                                        e0572fcd3a5c
  dune-configurator.3.24.2                           3a1922f062bb
  lwt.6.1.2                                          2d663783f713
  ocaml.5.3.0                                        92450889936d
  ocaml-base-compiler.5.3.0                          cdfe4719bb80
  ocaml-compiler.5.3.0                               c2fd8a2e2b36
  ocaml-compiler-libs.v0.17.0                        4bf56a360a8f
  ocaml-config.3                                     8168bc07a451
  ocamlbuild.0.16.1                                  62fb1a194cf7
  ocamlfind.1.9.8                                    3f8ff7716be7
  ocplib-endian.1.2                                  7acc1ddba750
  ppx_derivers.1.2.1                                 816724a5a727
  ppx_deriving_rpc.9.0.0                             9b30b5a327e9
  ppxlib.0.35.0                                      48ff0cc03858
  result.1.5                                         80a8f6f46e19
  rpc.9.0.0                                          514739b4488b
  rpclib.9.0.0                                       fbbe89ef23ca
  rpclib-lwt.9.0.0                                   85b2107c8a0d
  rresult.0.7.0                                      3e854bdaaed6
  sexplib0.v0.17.0                                   4722c993ecfd
  stdlib-shims.0.3.0                                 5f888484bdf1
  topkg.1.1.1                                        f53d1edc1273
  xmlm.1.4.0                                         d39a05699443
  yojson.3.0.0                                       71755957f63a
=== STDOUT ===
Processing: [default: loading data]
[WARNING] These additional system packages are required, but not available on your system: blktap-dev

The following system packages will first need to be installed:
    uuid-dev

<><> Handling external dependencies <><><><><><><><><><><><><><><><><><><><><><>

+ /usr/bin/sudo "apt-get" "install" "-qq" "-yy" "uuid-dev"
- E: Failed to fetch http://deb.debian.org/debian/pool/main/u/util-linux/uuid-dev_2.41-5_amd64.deb  404  Not Found [IP: 151.101.62.132 80]
- E: Unable to fetch some archives, maybe run apt-get update or try with --fix-missing?
[ERROR] System package install failed with exit code 100 at command:
            sudo apt-get install -qq -yy uuid-dev
[ERROR] These packages are still missing: uuid-dev

[NOTE] You can retry with '--assume-depexts' to skip this check, or run 'opam option depext=false' to permanently disable handling of system packages.

opam-build: depexts install failed; running apt-get update and retrying
[WARNING] These additional system packages are required, but not available on your system: blktap-dev

The following system packages will first need to be installed:
    uuid-dev

<><> Handling external dependencies <><><><><><><><><><><><><><><><><><><><><><>

+ /usr/bin/sudo "apt-get" "install" "-qq" "-yy" "uuid-dev"
- (Reading database ... 
(Reading database ... 5%
(Reading database ... 10%
(Reading database ... 15%
(Reading database ... 20%
(Reading database ... 25%
(Reading database ... 30%
(Reading database ... 35%
(Reading database ... 40%
(Reading database ... 45%
(Reading database ... 50%
(Reading database ... 55%
(Reading database ... 60%
(Reading database ... 65%
(Reading database ... 70%
(Reading database ... 75%
(Reading database ... 80%
(Reading database ... 85%
(Reading database ... 90%
(Reading database ... 95%
(Reading database ... 100%
(Reading database ... 20108 files and directories currently installed.)
- Preparing to unpack .../bsdutils_1%3a2.41.5-0+deb13u1_amd64.deb ...
- Unpacking bsdutils (1:2.41.5-0+deb13u1) over (1:2.41-5) ...
- Setting up bsdutils (1:2.41.5-0+deb13u1) ...
- (Reading database ... 
(Reading database ... 5%
(Reading database ... 10%
(Reading database ... 15%
(Reading database ... 20%
(Reading database ... 25%
(Reading database ... 30%
(Reading database ... 35%
(Reading database ... 40%
(Reading database ... 45%
(Reading database ... 50%
(Reading database ... 55%
(Reading database ... 60%
(Reading database ... 65%
(Reading database ... 70%
(Reading database ... 75%
(Reading database ... 80%
(Reading database ... 85%
(Reading database ... 90%
(Reading database ... 95%
(Reading database ... 100%
(Reading database ... 20108 files and directories currently installed.)
- Preparing to unpack .../liblastlog2-2_2.41.5-0+deb13u1_amd64.deb ...
- Unpacking liblastlog2-2:amd64 (2.41.5-0+deb13u1) over (2.41-5) ...
- Setting up liblastlog2-2:amd64 (2.41.5-0+deb13u1) ...
- (Reading database ... 
(Reading database ... 5%
(Reading database ... 10%
(Reading database ... 15%
(Reading database ... 20%
(Reading database ... 25%
(Reading database ... 30%
(Reading database ... 35%
(Reading database ... 40%
(Reading database ... 45%
(Reading database ... 50%
(Reading database ... 55%
(Reading database ... 60%
(Reading database ... 65%
(Reading database ... 70%
(Reading database ... 75%
(Reading database ... 80%
(Reading database ... 85%
(Reading database ... 90%
(Reading database ... 95%
(Reading database ... 100%
(Reading database ... 20108 files and directories currently installed.)
- Preparing to unpack .../libuuid1_2.41.5-0+deb13u1_amd64.deb ...
- Unpacking libuuid1:amd64 (2.41.5-0+deb13u1) over (2.41-5) ...
- Setting up libuuid1:amd64 (2.41.5-0+deb13u1) ...
- (Reading database ... 
(Reading database ... 5%
(Reading database ... 10%
(Reading database ... 15%
(Reading database ... 20%
(Reading database ... 25%
(Reading database ... 30%
(Reading database ... 35%
(Reading database ... 40%
(Reading database ... 45%
(Reading database ... 50%
(Reading database ... 55%
(Reading database ... 60%
(Reading database ... 65%
(Reading database ... 70%
(Reading database ... 75%
(Reading database ... 80%
(Reading database ... 85%
(Reading database ... 90%
(Reading database ... 95%
(Reading database ... 100%
(Reading database ... 20108 files and directories currently installed.)
- Preparing to unpack .../libblkid1_2.41.5-0+deb13u1_amd64.deb ...
- Unpacking libblkid1:amd64 (2.41.5-0+deb13u1) over (2.41-5) ...
- Setting up libblkid1:amd64 (2.41.5-0+deb13u1) ...
- (Reading database ... 
(Reading database ... 5%
(Reading database ... 10%
(Reading database ... 15%
(Reading database ... 20%
(Reading database ... 25%
(Reading database ... 30%
(Reading database ... 35%
(Reading database ... 40%
(Reading database ... 45%
(Reading database ... 50%
(Reading database ... 55%
(Reading database ... 60%
(Reading database ... 65%
(Reading database ... 70%
(Reading database ... 75%
(Reading database ... 80%
(Reading database ... 85%
(Reading database ... 90%
(Reading database ... 95%
(Reading database ... 100%
(Reading database ... 20108 files and directories currently installed.)
- Preparing to unpack .../libmount1_2.41.5-0+deb13u1_amd64.deb ...
- Unpacking libmount1:amd64 (2.41.5-0+deb13u1) over (2.41-5) ...
- Setting up libmount1:amd64 (2.41.5-0+deb13u1) ...
- (Reading database ... 
(Reading database ... 5%
(Reading database ... 10%
(Reading database ... 15%
(Reading database ... 20%
(Reading database ... 25%
(Reading database ... 30%
(Reading database ... 35%
(Reading database ... 40%
(Reading database ... 45%
(Reading database ... 50%
(Reading database ... 55%
(Reading database ... 60%
(Reading database ... 65%
(Reading database ... 70%
(Reading database ... 75%
(Reading database ... 80%
(Reading database ... 85%
(Reading database ... 90%
(Reading database ... 95%
(Reading database ... 100%
(Reading database ... 20108 files and directories currently installed.)
- Preparing to unpack .../libsmartcols1_2.41.5-0+deb13u1_amd64.deb ...
- Unpacking libsmartcols1:amd64 (2.41.5-0+deb13u1) over (2.41-5) ...
- Setting up libsmartcols1:amd64 (2.41.5-0+deb13u1) ...
- (Reading database ... 
(Reading database ... 5%
(Reading database ... 10%
(Reading database ... 15%
(Reading database ... 20%
(Reading database ... 25%
(Reading database ... 30%
(Reading database ... 35%
(Reading database ... 40%
(Reading database ... 45%
(Reading database ... 50%
(Reading database ... 55%
(Reading database ... 60%
(Reading database ... 65%
(Reading database ... 70%
(Reading database ... 75%
(Reading database ... 80%
(Reading database ... 85%
(Reading database ... 90%
(Reading database ... 95%
(Reading database ... 100%
(Reading database ... 20108 files and directories currently installed.)
- Preparing to unpack .../util-linux_2.41.5-0+deb13u1_amd64.deb ...
- Unpacking util-linux (2.41.5-0+deb13u1) over (2.41-5) ...
- Setting up util-linux (2.41.5-0+deb13u1) ...
- (Reading database ... 
(Reading database ... 5%
(Reading database ... 10%
(Reading database ... 15%
(Reading database ... 20%
(Reading database ... 25%
(Reading database ... 30%
(Reading database ... 35%
(Reading database ... 40%
(Reading database ... 45%
(Reading database ... 50%
(Reading database ... 55%
(Reading database ... 60%
(Reading database ... 65%
(Reading database ... 70%
(Reading database ... 75%
(Reading database ... 80%
(Reading database ... 85%
(Reading database ... 90%
(Reading database ... 95%
(Reading database ... 100%
(Reading database ... 20113 files and directories currently installed.)
- Preparing to unpack .../mount_2.41.5-0+deb13u1_amd64.deb ...
- Unpacking mount (2.41.5-0+deb13u1) over (2.41-5) ...
- Preparing to unpack .../login_1%3a4.16.0-2+really2.41.5-0+deb13u1_amd64.deb ...
- Unpacking login (1:4.16.0-2+really2.41.5-0+deb13u1) over (1:4.16.0-2+really2.41-5) ...
- Selecting previously unselected package uuid-dev:amd64.
- Preparing to unpack .../uuid-dev_2.41.5-0+deb13u1_amd64.deb ...
- Unpacking uuid-dev:amd64 (2.41.5-0+deb13u1) ...
- Setting up uuid-dev:amd64 (2.41.5-0+deb13u1) ...
- Setting up mount (2.41.5-0+deb13u1) ...
- Setting up login (1:4.16.0-2+really2.41.5-0+deb13u1) ...
- Processing triggers for libc-bin (2.41-12+deb13u3) ...
[vhdlib.0.9.1: dl]
[vhdlib.0.9.1: extract]
-> retrieved vhdlib.0.9.1  (https://opam.ocaml.org/cache)
[vhdlib: make]
+ /usr/bin/make  (CWD=/home/opam/.opam/default/.opam-switch/build/vhdlib.0.9.1)
- ocaml setup.ml -configure 
- File "./setup.ml", line 213, characters 8-26:
- 213 |         buf.[i] <- f s.[i]
-               ^^^^^^^^^^^^^^^^^^
- Error: Syntax error: strings are immutable, there is no assignment syntax for them.
- Hint: Mutable sequences of bytes are available in the Bytes module.
- Hint: Did you mean to use "Bytes.set"?
- make: *** [Makefile:32: setup.data] Error 2
[ERROR] The compilation of vhdlib.0.9.1 failed at "make".
build failed... 

=== STDERR ===

2026-10-22 04:01.15: FAILED: build vhdlib.0.9.1
2026-10-22 04:01.15: Job failed: build failed: vhdlib.0.9.1