Build:
- 0
2026-10-21 23:44.26: New job: build kinetic-client.0.0.9 (efff6d77ab9b)
2026-10-21 23:44.26: Waiting for resource in pool day11-builds
2026-10-22 02:19.39: Got resource from pool day11-builds
2026-10-22 02:19.39: [profile full] build kinetic-client.0.0.9
2026-10-22 02:19.40: build kinetic-client.0.0.9 (efff6d77ab9b)
=== DEPENDENCIES (42 transitive) ===
base-bytes.base 2b073d679040
base-threads.base ca51096a9c5b
base-unix.base 88a83b7ed333
base64.3.5.2 78366162ea47
cmdliner.1.3.0 d087df1229ce
conf-gmp.5 d0211a82c71f
conf-gmp-powm-sec.4 acc832c3bdda
conf-libssl.4 9a6f007648db
conf-pkg-config.5 26be2768a637
conf-which.1 e5dee02ff34e
conf-zlib.1 1bee7a3e7aa2
cppo.1.8.0 9f6eb1046695
cryptokit.1.21.1 3ff1eb0dae66
csexp.1.5.2 2d9aad88fd83
dune.3.24.2 354f182a4824
dune-configurator.3.24.2 c64f06298a93
easy-format.1.3.4 6839a559262c
gen.1.1 7aed5b200b6b
lwt.5.10.1 bd0d359293bb
lwt_log.1.1.2 c1a6f7ce0eae
lwt_ssl.1.2.0 3634d7128f6b
ocaml.4.14.4 2cc549d6f8d5
ocaml-base-compiler.4.14.4 ecbd009faad9
ocaml-compiler-libs.v0.12.4 9dbc6026593e
ocaml-config.2 c0047cbf7f6a
ocamlbuild.0.16.1 7b2793ce8182
ocamlfind.1.9.8 775658c4e58c
ocplib-endian.1.2 743b1daeabf2
piqi.0.7.8 4fa58c9ecebc
piqilib.0.6.16 b9fcfcafcf39
ppx_derivers.1.2.1 0e78ab2c0cc7
ppx_deriving.6.0.3 22891d620f9c
ppxlib.0.35.0 9f3548b7c8cf
sedlex.2.6 579ef276ee3c
seq.base da83aa6fcae2
sexplib0.v0.17.0 6bada974deec
ssl.0.8.0 d4f16b87a1ba
stdlib-shims.0.3.0 419cf0ff9040
topkg.1.1.1 87e63ede0e3c
uchar.0.0.2 5bedb02f5401
xmlm.1.4.0 4bc62e24a5db
zarith.1.14 3789491f3c85
=== STDOUT ===
Processing: [default: loading data]
The following system packages will first need to be installed:
protobuf-compiler
<><> Handling external dependencies <><><><><><><><><><><><><><><><><><><><><><>
+ /usr/bin/sudo "apt-get" "install" "-qq" "-yy" "protobuf-compiler"
- Selecting previously unselected package zlib1g-dev:amd64.
- (Reading database ...
(Reading database ... 5%
(Reading database ... 10%
(Reading database ... 15%
(Reading database ... 20%
(Reading database ... 25%
(Reading database ... 30%
(Reading database ... 35%
(Reading database ... 40%
(Reading database ... 45%
(Reading database ... 50%
(Reading database ... 55%
(Reading database ... 60%
(Reading database ... 65%
(Reading database ... 70%
(Reading database ... 75%
(Reading database ... 80%
(Reading database ... 85%
(Reading database ... 90%
(Reading database ... 95%
(Reading database ... 100%
(Reading database ... 20131 files and directories currently installed.)
- Preparing to unpack .../0-zlib1g-dev_1%3a1.3.dfsg+really1.3.1-1+b1_amd64.deb ...
- Unpacking zlib1g-dev:amd64 (1:1.3.dfsg+really1.3.1-1+b1) ...
- Selecting previously unselected package libprotobuf32t64:amd64.
- Preparing to unpack .../1-libprotobuf32t64_3.21.12-11+deb13u1_amd64.deb ...
- Unpacking libprotobuf32t64:amd64 (3.21.12-11+deb13u1) ...
- Selecting previously unselected package libprotobuf-lite32t64:amd64.
- Preparing to unpack .../2-libprotobuf-lite32t64_3.21.12-11+deb13u1_amd64.deb ...
- Unpacking libprotobuf-lite32t64:amd64 (3.21.12-11+deb13u1) ...
- Selecting previously unselected package libprotobuf-dev:amd64.
- Preparing to unpack .../3-libprotobuf-dev_3.21.12-11+deb13u1_amd64.deb ...
- Unpacking libprotobuf-dev:amd64 (3.21.12-11+deb13u1) ...
- Selecting previously unselected package libprotoc32t64:amd64.
- Preparing to unpack .../4-libprotoc32t64_3.21.12-11+deb13u1_amd64.deb ...
- Unpacking libprotoc32t64:amd64 (3.21.12-11+deb13u1) ...
- Selecting previously unselected package protobuf-compiler.
- Preparing to unpack .../5-protobuf-compiler_3.21.12-11+deb13u1_amd64.deb ...
- Unpacking protobuf-compiler (3.21.12-11+deb13u1) ...
- Setting up libprotobuf-lite32t64:amd64 (3.21.12-11+deb13u1) ...
- Setting up libprotobuf32t64:amd64 (3.21.12-11+deb13u1) ...
- Setting up zlib1g-dev:amd64 (1:1.3.dfsg+really1.3.1-1+b1) ...
- Setting up libprotoc32t64:amd64 (3.21.12-11+deb13u1) ...
- Setting up protobuf-compiler (3.21.12-11+deb13u1) ...
- Setting up libprotobuf-dev:amd64 (3.21.12-11+deb13u1) ...
- Processing triggers for libc-bin (2.41-12+deb13u3) ...
[kinetic-client.0.0.9: dl]
[kinetic-client.0.0.9: extract]
-> retrieved kinetic-client.0.0.9 (https://opam.ocaml.org/cache)
[kinetic-client: make]
+ /usr/bin/make (CWD=/home/opam/.opam/default/.opam-switch/build/kinetic-client.0.0.9)
[ERROR] The compilation of kinetic-client.0.0.9 failed at "make".
- piqi of-proto src/kinetic.proto -o src/kinetic.proto.piqi
- piqic-ocaml --embed-piqi -C src src/kinetic.proto.piqi
- ocamlbuild -use-ocamlfind test_it.native
- + ocamlfind ocamlc -config
- + ocamlfind ocamldep -package ppx_deriving.std -package cmdliner -package cryptokit -package lwt.unix -package lwt_log -package lwt_ssl -package lwt -modules examples/test_it.ml > examples/test_it.ml.depends
- + ocamlfind ocamldep -package ppx_deriving.std -package cmdliner -package cryptokit -package lwt.unix -package lwt_log -package lwt_ssl -package lwt -modules src/kinetic.mli > src/kinetic.mli.depends
- + ocamlfind ocamldep -package ppx_deriving.std -package cmdliner -package cryptokit -package lwt.unix -package lwt_log -package lwt_ssl -package lwt -modules src/kinetic_util.ml > src/kinetic_util.ml.depends
- + ocamlfind ocamlc -c -g -annot -thread -package ppx_deriving.std -package cmdliner -package cryptokit -package lwt.unix -package lwt_log -package lwt_ssl -package lwt -I src -I examples -o src/kinetic.cmi src/kinetic.mli
- + ocamlfind ocamlc -c -g -annot -thread -package ppx_deriving.std -package cmdliner -package cryptokit -package lwt.unix -package lwt_log -package lwt_ssl -package lwt -I src -I examples -o src/kinetic_util.cmo src/kinetic_util.ml
- + ocamlfind ocamlc -c -g -annot -thread -package ppx_deriving.std -package cmdliner -package cryptokit -package lwt.unix -package lwt_log -package lwt_ssl -package lwt -I examples -I src -o examples/test_it.cmo examples/test_it.ml
- + ocamlfind ocamlc -c -g -annot -thread -package ppx_deriving.std -package cmdliner -package cryptokit -package lwt.unix -package lwt_log -package lwt_ssl -package lwt -I examples -I src -o examples/test_it.cmo examples/test_it.ml
- File "examples/test_it.ml", line 54, characters 15-32:
- 54 | K.get client "I do not exist?" >>=? fun vo ->
- ^^^^^^^^^^^^^^^^^
- Error: This expression has type string but an expression was expected of type
- Kinetic.key = bytes
- Command exited with code 2.
- make: *** [Makefile:13: example] Error 10
build failed...
=== STDERR ===
2026-10-22 02:21.30: FAILED: build kinetic-client.0.0.9
2026-10-22 02:21.30: Job failed: build failed: kinetic-client.0.0.9