Build:
  1. 1
  2. 0
2026-10-21 23:05.46: New job: build metapp.0.4.3 (fefd0ecb9418)
2026-10-21 23:05.46: Waiting for resource in pool day11-builds
2026-10-21 23:53.09: Got resource from pool day11-builds
2026-10-21 23:53.09: [profile full] build metapp.0.4.3
2026-10-21 23:53.09: build metapp.0.4.3 (fefd0ecb9418)
=== DEPENDENCIES (18 transitive) ===
  base-threads.base                                  ca51096a9c5b
  base-unix.base                                     88a83b7ed333
  conf-autoconf.1                                    5ab3ab11f357
  conf-automake.1                                    8f91ae630e58
  dune.3.24.2                                        adc8534aaee3
  ocaml.4.12.1                                       9f11d68ab027
  ocaml-base-compiler.4.12.1                         f3fe6b0ae528
  ocaml-compiler-libs.v0.12.4                        3af2469a1977
  ocaml-config.2                                     51cd011547ac
  ocaml-migrate-parsetree.2.4.0                      7e162786d304
  ocaml-secondary-compiler.4.14.2                    ad00659de5da
  ocamlfind.1.9.6                                    fb8a0e6a74c9
  ocamlfind-secondary.1.9.6                          b8c3977ad934
  ppx_derivers.1.2.1                                 bd3e6faa536c
  ppxlib.0.22.2                                      3846352f3229
  sexplib0.v0.16.0                                   3b0eda376af7
  stdcompat.18                                       c210bb7eddaa
  stdlib-shims.0.3.0                                 173ef77a991d
=== STDOUT ===
Processing: [default: loading data]
[metapp.0.4.3: dl]
[metapp.0.4.3: extract]
-> retrieved metapp.0.4.3  (https://opam.ocaml.org/cache)
[metapp: dune build]
+ /home/opam/.opam/default/bin/dune "build" "-p" "metapp" "-j" "39" "@install" (CWD=/home/opam/.opam/default/.opam-switch/build/metapp.0.4.3)
- File "metapp/dune", line 3, characters 14-30:
- 3 |   (preprocess (pps metapp.ppx))
-                   ^^^^^^^^^^^^^^^^
- (cd _build/default && .ppx/e17850eae66b6b5844e45f672bc501f8/ppx.exe --cookie 'library-name="metapp"' -o metapp/metapp.pp.mli --intf metapp/metapp.mli -corrected-suffix .ppx-corrected -diff-cmd - -dump-ast)
- findlib: [WARNING] Interface topdirs.cmi occurs in several directories: /home/opam/.opam/default/lib/ocaml, /home/opam/.opam/default/lib/ocaml/compiler-libs
- File "_none_", line 1:
- Warning 58 [no-cmx-file]: no cmx file was found in path for module Metapp_api, and its interface was not compiled with -opaque
- File "_none_", line 1:
- Error: error loading shared library: Dynlink.Error (Dynlink.Cannot_open_dll "Failure(\"/tmp/build_0d04f5_dune/metapp8e187e.cmxs: failed to map segment from shared object\")")
- File "metapp/dune", line 3, characters 14-30:
- 3 |   (preprocess (pps metapp.ppx))
-                   ^^^^^^^^^^^^^^^^
- (cd _build/default && .ppx/e17850eae66b6b5844e45f672bc501f8/ppx.exe --cookie 'library-name="metapp"' -o metapp/metapp.pp.ml --impl metapp/metapp.ml -corrected-suffix .ppx-corrected -diff-cmd - -dump-ast)
- findlib: [WARNING] Interface topdirs.cmi occurs in several directories: /home/opam/.opam/default/lib/ocaml, /home/opam/.opam/default/lib/ocaml/compiler-libs
- File "_none_", line 1:
- Warning 58 [no-cmx-file]: no cmx file was found in path for module Metapp_api, and its interface was not compiled with -opaque
- File "_none_", line 1:
- Warning 58 [no-cmx-file]: no cmx file was found in path for module Metapp_preutils, and its interface was not compiled with -opaque
- File "_none_", line 1:
- Error: error loading shared library: Dynlink.Error (Dynlink.Cannot_open_dll "Failure(\"/tmp/build_0d04f5_dune/metapp9ee0d3.cmxs: failed to map segment from shared object\")")
[ERROR] The compilation of metapp.0.4.3 failed at "dune build -p metapp -j 39 @install".
build failed... 

=== STDERR ===

2026-10-21 23:54.00: FAILED: build metapp.0.4.3
2026-10-21 23:54.00: Job failed: build failed: metapp.0.4.3