Build:
  1. 1
  2. 0
2026-10-21 23:05.46: New job: build metapp.0.4.3 (abcf3b35cd1d)
2026-10-21 23:05.46: Waiting for resource in pool day11-builds
2026-10-21 23:51.31: Got resource from pool day11-builds
2026-10-21 23:51.31: [profile full] build metapp.0.4.3
2026-10-21 23:51.32: build metapp.0.4.3 (abcf3b35cd1d)
=== DEPENDENCIES (17 transitive) ===
  base-threads.base                                  ca51096a9c5b
  base-unix.base                                     88a83b7ed333
  conf-autoconf.1                                    5ab3ab11f357
  conf-automake.1                                    8f91ae630e58
  dune.3.24.2                                        859a21fcf334
  ocaml.4.13.1                                       d824530970d2
  ocaml-base-compiler.4.13.1                         3bcdb3067e72
  ocaml-compiler-libs.v0.12.4                        2364b0354d70
  ocaml-config.2                                     7b32a9542b55
  ocaml-secondary-compiler.4.14.2                    ad00659de5da
  ocamlfind.1.9.6                                    f141e334ae42
  ocamlfind-secondary.1.9.6                          f8dc97ad8369
  ppx_derivers.1.2.1                                 c4137bb9f672
  ppxlib.0.25.1                                      caf0bd3dbe35
  sexplib0.v0.16.0                                   e361adfc249f
  stdcompat.18                                       414a8855485c
  stdlib-shims.0.3.0                                 b581b3e5357f
=== STDOUT ===
Processing: [default: loading data]
[metapp.0.4.3: dl]
[metapp.0.4.3: extract]
-> retrieved metapp.0.4.3  (https://opam.ocaml.org/cache)
[metapp: dune build]
+ /home/opam/.opam/default/bin/dune "build" "-p" "metapp" "-j" "39" "@install" (CWD=/home/opam/.opam/default/.opam-switch/build/metapp.0.4.3)
- File "metapp/dune", line 3, characters 14-30:
- 3 |   (preprocess (pps metapp.ppx))
-                   ^^^^^^^^^^^^^^^^
- (cd _build/default && .ppx/e17850eae66b6b5844e45f672bc501f8/ppx.exe --cookie 'library-name="metapp"' -o metapp/metapp.pp.mli --intf metapp/metapp.mli -corrected-suffix .ppx-corrected -diff-cmd - -dump-ast)
- findlib: [WARNING] Interface topdirs.cmi occurs in several directories: /home/opam/.opam/default/lib/ocaml, /home/opam/.opam/default/lib/ocaml/compiler-libs
- File "_none_", line 1:
- Warning 58 [no-cmx-file]: no cmx file was found in path for module Metapp_api, and its interface was not compiled with -opaque
- File "_none_", line 1:
- Error: error loading shared library: Dynlink.Error (Dynlink.Cannot_open_dll "Failure(\"/tmp/build_aefe67_dune/metapp4abb9a.cmxs: failed to map segment from shared object\")")
- File "metapp/dune", line 3, characters 14-30:
- 3 |   (preprocess (pps metapp.ppx))
-                   ^^^^^^^^^^^^^^^^
- (cd _build/default && .ppx/e17850eae66b6b5844e45f672bc501f8/ppx.exe --cookie 'library-name="metapp"' -o metapp/metapp.pp.ml --impl metapp/metapp.ml -corrected-suffix .ppx-corrected -diff-cmd - -dump-ast)
- findlib: [WARNING] Interface topdirs.cmi occurs in several directories: /home/opam/.opam/default/lib/ocaml, /home/opam/.opam/default/lib/ocaml/compiler-libs
- File "_none_", line 1:
- Warning 58 [no-cmx-file]: no cmx file was found in path for module Metapp_api, and its interface was not compiled with -opaque
- File "_none_", line 1:
- Warning 58 [no-cmx-file]: no cmx file was found in path for module Metapp_preutils, and its interface was not compiled with -opaque
- File "_none_", line 1:
- Error: error loading shared library: Dynlink.Error (Dynlink.Cannot_open_dll "Failure(\"/tmp/build_aefe67_dune/metapp823883.cmxs: failed to map segment from shared object\")")
[ERROR] The compilation of metapp.0.4.3 failed at "dune build -p metapp -j 39 @install".
build failed... 

=== STDERR ===

2026-10-21 23:52.06: FAILED: build metapp.0.4.3
2026-10-21 23:52.06: Job failed: build failed: metapp.0.4.3