Build:
  1. 1
  2. 0
2026-10-21 23:05.46: New job: build zxcvbn.2.0+1 (658ae4afa389)
2026-10-21 23:05.46: Waiting for resource in pool day11-builds
2026-10-21 23:53.01: Got resource from pool day11-builds
2026-10-21 23:53.01: [profile full] build zxcvbn.2.0+1
2026-10-21 23:53.01: build zxcvbn.2.0+1 (658ae4afa389)
=== DEPENDENCIES (16 transitive) ===
  base-threads.base                                  ca51096a9c5b
  base-unix.base                                     88a83b7ed333
  cppo.1.8.0                                         6cd392a42ba4
  dune.3.22.2                                        706d6641ae15
  ocaml.4.12.1                                       9f11d68ab027
  ocaml-base-compiler.4.12.1                         f3fe6b0ae528
  ocaml-config.2                                     51cd011547ac
  ocaml-migrate-parsetree.1.8.0                      6523795f2510
  ocamlbuild.0.16.1                                  4ee5ccc4f975
  ocamlfind.1.9.8                                    ca20b5ce2716
  ppx_derivers.1.2.1                                 e73d6de78663
  ppx_deriving.4.5-1                                 696e93ab4459
  ppx_tools.6.6                                      e92916eb29a0
  ppxfind.1.4                                        778b55a99e31
  result.1.5                                         0282b1c20a70
  topkg.1.1.1                                        9d4e3bef4d69
=== STDOUT ===
Processing: [default: loading data]
[zxcvbn.2.0+1: dl]
[zxcvbn.2.0+1: extract]
-> retrieved zxcvbn.2.0+1  (https://opam.ocaml.org/cache)
[zxcvbn: ocaml build]
+ /home/opam/.opam/default/bin/ocaml "pkg/pkg.ml" "build" "--pinned" "false" (CWD=/home/opam/.opam/default/.opam-switch/build/zxcvbn.2.0+1)
- + ocamlfind ocamlc -config
- + ocamlfind ocamlopt unix.cmxa -I /home/opam/.opam/default/lib/ocamlbuild /home/opam/.opam/default/lib/ocamlbuild/ocamlbuildlib.cmxa -linkpkg myocamlbuild.ml /home/opam/.opam/default/lib/ocamlbuild/ocamlbuild.cmx -o myocamlbuild
- + ocamlfind ocamlc -config
- + ocamlfind ocamlc -g -ccopt '-I vendor' -ccopt '-I vendor' -package ppx_deriving.runtime -package ppx_deriving.std -c vendor/zxcvbn.c
- + ocamlfind ocamlc -g -package ppx_deriving.runtime -package ppx_deriving.std -c src/zxcvbn_stubs.c
- + mv zxcvbn_stubs.o src/zxcvbn_stubs.o
- + mv zxcvbn.o vendor/zxcvbn.o
- + ocamlfind ocamlmklib -o src/zxcvbn_stubs -g vendor/zxcvbn.o src/zxcvbn_stubs.o
- + ocamlfind ocamldep -package ppx_deriving.runtime -package ppx_deriving.std -modules src/zxcvbn.ml > src/zxcvbn.ml.depends
- + ocamlfind ocamldep -package ppx_deriving.runtime -package ppx_deriving.std -modules src/zxcvbn.mli > src/zxcvbn.mli.depends
- + ocamlfind ocamlc -c -g -bin-annot -safe-string -package ppx_deriving.runtime -package ppx_deriving.std -I src -o src/zxcvbn.cmi src/zxcvbn.mli
- + ocamlfind ocamlopt -c -g -bin-annot -safe-string -package ppx_deriving.runtime -package ppx_deriving.std -I src -o src/zxcvbn.cmx src/zxcvbn.ml
- + ocamlfind ocamlopt -a -cclib -lzxcvbn_stubs -package ppx_deriving.runtime -package ppx_deriving.std -I src src/zxcvbn.cmx -o src/zxcvbn.cmxa
- + ocamlfind ocamlc -c -g -bin-annot -safe-string -package ppx_deriving.runtime -package ppx_deriving.std -I src -o src/zxcvbn.cmo src/zxcvbn.ml
- + ocamlfind ocamlopt -shared -linkall src/libzxcvbn_stubs.a -package ppx_deriving.runtime -package ppx_deriving.std -I src src/zxcvbn.cmxa -o src/zxcvbn.cmxs
- + ocamlfind ocamlc -a -dllib -lzxcvbn_stubs -package ppx_deriving.runtime -package ppx_deriving.std -I src src/zxcvbn.cmo -o src/zxcvbn.cma
- Solver failed:
-   Ocamlbuild knows of no rules that apply to a target named src/pkg.itarget. This can happen if you ask Ocamlbuild to build a target with the wrong extension (e.g. .opt instead of .native) or if the source files live in directories that have not been specified as include directories.
- Backtrace:
-   - Failed to build the target pkg.otarget
-       - Failed to build all of these:
-           - Building src/pkg.otarget:
-               - Building src/pkg.itarget
-           - Building pkg.otarget:
-               - Building src/vendor/zxcvbn.c
- pkg.ml: [ERROR] cmd ['ocamlbuild' '-use-ocamlfind' '-classic-display' '-j' '4' '-tag' 'debug'
-      '-build-dir' '_build' 'pkg.otarget']: exited with 6
[ERROR] The compilation of zxcvbn.2.0+1 failed at "ocaml pkg/pkg.ml build --pinned false".
build failed... 

=== STDERR ===

2026-10-21 23:53.40: FAILED: build zxcvbn.2.0+1
2026-10-21 23:53.40: Job failed: build failed: zxcvbn.2.0+1