Build:
- 0
2026-10-21 19:34.16: New job: build conjury.2.1.1 (b1f2ede6a74a) 2026-10-21 19:34.16: Waiting for resource in pool day11-builds 2026-10-21 20:24.47: Got resource from pool day11-builds 2026-10-21 20:24.47: [profile full] build conjury.2.1.1 2026-10-21 20:24.47: build conjury.2.1.1 (b1f2ede6a74a) === DEPENDENCIES (11 transitive) === base-threads.base ca51096a9c5b base-unix.base 88a83b7ed333 dune.3.24.2 354f182a4824 ocaml.4.14.4 2cc549d6f8d5 ocaml-base-compiler.4.14.4 ecbd009faad9 ocaml-config.2 c0047cbf7f6a ocamlfind.1.9.8 775658c4e58c omake.0.10.7 6587d38270f2 ounit2.2.2.7 635d09871822 seq.base da83aa6fcae2 stdlib-shims.0.3.0 419cf0ff9040 === STDOUT === Processing: [default: loading data] [conjury.2.1.1: dl] [conjury.2.1.1: extract] -> retrieved conjury.2.1.1 (https://opam.ocaml.org/cache) [conjury: omake build] + /home/opam/.opam/default/bin/omake "--dotomake.omake" "--force-dotomake" "--configure" "build" (CWD=/home/opam/.opam/default/.opam-switch/build/conjury.2.1.1) - *** omake: reading OMakefiles - *** omake: finished reading OMakefiles (0.20 sec) - *** omake: done (0.21 sec, 0/0 scans, 0/0 rules, 11/45 digests) -> compiled conjury.2.1.1 [conjury: omake install] + /home/opam/.opam/default/bin/omake "--dotomake.omake" "--force-dotomake" "install" (CWD=/home/opam/.opam/default/.opam-switch/build/conjury.2.1.1) - *** omake: reading OMakefiles - *** omake error: - File Conjury/Basis/Exceptions.om: line 59, characters 8-21 - Uncaught Exception: - External requirement: Header <stddef.h> not available! [ERROR] The installation of conjury failed at "omake --dotomake.omake --force-dotomake install". install failed... === STDERR === 2026-10-21 20:26.31: FAILED: build conjury.2.1.1 2026-10-21 20:26.31: Job failed: build failed: conjury.2.1.1