Build:
- 1
- 0
2026-10-21 19:32.35: New job: build metapp.0.4.4 (6723d318c39b)
2026-10-21 19:32.35: Waiting for resource in pool day11-builds
2026-10-21 20:16.45: Got resource from pool day11-builds
2026-10-21 20:16.45: [profile full] build metapp.0.4.4
2026-10-21 20:16.45: build metapp.0.4.4 (6723d318c39b)
=== DEPENDENCIES (13 transitive) ===
base-threads.base ca51096a9c5b
base-unix.base 88a83b7ed333
dune.3.24.2 7519a4549be9
ocaml.5.2.1 2d686c4b1c5c
ocaml-base-compiler.5.2.1 d3ca04326b5c
ocaml-compiler-libs.v0.17.0 ddee96b6efe3
ocaml-config.3 661eb037103e
ocamlfind.1.9.8 073598b8b9bf
ppx_derivers.1.2.1 6d121477b8a8
ppxlib.0.35.0 aad438722066
sexplib0.v0.17.0 d547de7785df
stdcompat.21.1 2052b1cd0722
stdlib-shims.0.3.0 c9f864280571
=== STDOUT ===
Processing: [default: loading data]
[metapp.0.4.4: dl]
[metapp.0.4.4: extract]
-> retrieved metapp.0.4.4 (https://opam.ocaml.org/cache)
[metapp: dune build]
+ /home/opam/.opam/default/bin/dune "build" "-p" "metapp" "-j" "39" "@install" (CWD=/home/opam/.opam/default/.opam-switch/build/metapp.0.4.4)
- (cd _build/default && .ppx/e17850eae66b6b5844e45f672bc501f8/ppx.exe --cookie 'library-name="metapp"' -o metapp/metapp.pp.mli --intf metapp/metapp.mli -corrected-suffix .ppx-corrected -diff-cmd - -dump-ast)
- File "_none_", line 1:
- Warning 58 [no-cmx-file]: no cmx file was found in path for module Metapp_api, and its interface was not compiled with -opaque
-
- File "_none_", line 1:
- Warning 58 [no-cmx-file]: no cmx file was found in path for module Metapp_version_info, and its interface was not compiled with -opaque
- File "_none_", line 1:
- Error: error loading shared library: Failure("/tmp/build_14d8b5_dune/metapp43c86f.cmxs: failed to map segment from shared object")
- (cd _build/default && .ppx/e17850eae66b6b5844e45f672bc501f8/ppx.exe --cookie 'library-name="metapp"' -o metapp/metapp.pp.ml --impl metapp/metapp.ml -corrected-suffix .ppx-corrected -diff-cmd - -dump-ast)
- File "_none_", line 1:
- Warning 58 [no-cmx-file]: no cmx file was found in path for module Metapp_api, and its interface was not compiled with -opaque
-
- File "_none_", line 1:
- Warning 58 [no-cmx-file]: no cmx file was found in path for module Metapp_preutils, and its interface was not compiled with -opaque
-
- File "_none_", line 1:
- Warning 58 [no-cmx-file]: no cmx file was found in path for module Metapp_version_info, and its interface was not compiled with -opaque
- File "_none_", line 1:
- Error: error loading shared library: Failure("/tmp/build_14d8b5_dune/metappe15a4e.cmxs: failed to map segment from shared object")
[ERROR] The compilation of metapp.0.4.4 failed at "dune build -p metapp -j 39 @install".
build failed...
=== STDERR ===
2026-10-21 20:19.21: FAILED: build metapp.0.4.4
2026-10-21 20:19.21: Job failed: build failed: metapp.0.4.4