Build:
  1. 1
  2. 0
2026-10-21 19:32.35: New job: build metapp.0.4.4 (133f55ccdc16)
2026-10-21 19:32.35: Waiting for resource in pool day11-builds
2026-10-21 20:16.45: Got resource from pool day11-builds
2026-10-21 20:16.45: [profile full] build metapp.0.4.4
2026-10-21 20:16.45: build metapp.0.4.4 (133f55ccdc16)
=== DEPENDENCIES (13 transitive) ===
  base-threads.base                                  ca51096a9c5b
  base-unix.base                                     88a83b7ed333
  dune.3.24.2                                        53f0435285a4
  ocaml.5.1.1                                        173d62cee2dc
  ocaml-base-compiler.5.1.1                          1c5619553879
  ocaml-compiler-libs.v0.12.4                        950b1bfa6b5d
  ocaml-config.3                                     e40ef2094304
  ocamlfind.1.9.8                                    0c4ab3c3f266
  ppx_derivers.1.2.1                                 331ee9bcb2d9
  ppxlib.0.35.0                                      3d6bac866103
  sexplib0.v0.17.0                                   060987a4f031
  stdcompat.21.1                                     633a47177d97
  stdlib-shims.0.3.0                                 b4b9b15b430f
=== STDOUT ===
Processing: [default: loading data]
[metapp.0.4.4: dl]
[metapp.0.4.4: extract]
-> retrieved metapp.0.4.4  (https://opam.ocaml.org/cache)
[metapp: dune build]
+ /home/opam/.opam/default/bin/dune "build" "-p" "metapp" "-j" "39" "@install" (CWD=/home/opam/.opam/default/.opam-switch/build/metapp.0.4.4)
- (cd _build/default && .ppx/e17850eae66b6b5844e45f672bc501f8/ppx.exe --cookie 'library-name="metapp"' -o metapp/metapp.pp.ml --impl metapp/metapp.ml -corrected-suffix .ppx-corrected -diff-cmd - -dump-ast)
- File "_none_", line 1:
- Warning 58 [no-cmx-file]: no cmx file was found in path for module Metapp_api, and its interface was not compiled with -opaque
- 
- File "_none_", line 1:
- Warning 58 [no-cmx-file]: no cmx file was found in path for module Metapp_preutils, and its interface was not compiled with -opaque
- 
- File "_none_", line 1:
- Warning 58 [no-cmx-file]: no cmx file was found in path for module Metapp_version_info, and its interface was not compiled with -opaque
- File "_none_", line 1:
- Error: error loading shared library: Dynlink.Error (Dynlink.Cannot_open_dll "Failure(\"/tmp/build_cdd65d_dune/metapp563d8b.cmxs: failed to map segment from shared object\")")
- (cd _build/default && .ppx/e17850eae66b6b5844e45f672bc501f8/ppx.exe --cookie 'library-name="metapp"' -o metapp/metapp.pp.mli --intf metapp/metapp.mli -corrected-suffix .ppx-corrected -diff-cmd - -dump-ast)
- File "_none_", line 1:
- Warning 58 [no-cmx-file]: no cmx file was found in path for module Metapp_api, and its interface was not compiled with -opaque
- 
- File "_none_", line 1:
- Warning 58 [no-cmx-file]: no cmx file was found in path for module Metapp_version_info, and its interface was not compiled with -opaque
- File "_none_", line 1:
- Error: error loading shared library: Dynlink.Error (Dynlink.Cannot_open_dll "Failure(\"/tmp/build_cdd65d_dune/metappe5b5da.cmxs: failed to map segment from shared object\")")
[ERROR] The compilation of metapp.0.4.4 failed at "dune build -p metapp -j 39 @install".
build failed... 

=== STDERR ===

2026-10-21 20:19.21: FAILED: build metapp.0.4.4
2026-10-21 20:19.21: Job failed: build failed: metapp.0.4.4