Build:
  1. 1
  2. 0
2026-10-21 19:08.07: New job: build metapp.0.4.4 (09238773c88b)
2026-10-21 19:08.07: Waiting for resource in pool day11-builds
2026-10-21 20:05.00: Got resource from pool day11-builds
2026-10-21 20:05.00: [profile full] build metapp.0.4.4
2026-10-21 20:05.00: build metapp.0.4.4 (09238773c88b)
=== DEPENDENCIES (13 transitive) ===
  base-threads.base                                  ca51096a9c5b
  base-unix.base                                     88a83b7ed333
  dune.3.24.2                                        2f138705a519
  ocaml.5.0.0                                        952750df80e8
  ocaml-base-compiler.5.0.0                          e696a2038b3f
  ocaml-compiler-libs.v0.12.4                        d93d314e997f
  ocaml-config.3                                     4d94cf046bcb
  ocamlfind.1.9.8                                    c7c236f982a5
  ppx_derivers.1.2.1                                 dc87a82c1c4c
  ppxlib.0.25.1                                      543bafc7ddfa
  sexplib0.v0.17.0                                   a64875529b1b
  stdcompat.21.1                                     dd7a208c28ce
  stdlib-shims.0.3.0                                 c1e37379d632
=== STDOUT ===
Processing: [default: loading data]
[metapp.0.4.4: dl]
[metapp.0.4.4: extract]
-> retrieved metapp.0.4.4  (https://opam.ocaml.org/cache)
[metapp: dune build]
+ /home/opam/.opam/default/bin/dune "build" "-p" "metapp" "-j" "39" "@install" (CWD=/home/opam/.opam/default/.opam-switch/build/metapp.0.4.4)
- (cd _build/default && .ppx/e17850eae66b6b5844e45f672bc501f8/ppx.exe --cookie 'library-name="metapp"' -o metapp/metapp.pp.ml --impl metapp/metapp.ml -corrected-suffix .ppx-corrected -diff-cmd - -dump-ast)
- File "_none_", line 1:
- Warning 58 [no-cmx-file]: no cmx file was found in path for module Metapp_api, and its interface was not compiled with -opaque
- File "_none_", line 1:
- Warning 58 [no-cmx-file]: no cmx file was found in path for module Metapp_preutils, and its interface was not compiled with -opaque
- File "_none_", line 1:
- Warning 58 [no-cmx-file]: no cmx file was found in path for module Metapp_version_info, and its interface was not compiled with -opaque
- File "_none_", line 1:
- Error: error loading shared library: Dynlink.Error (Dynlink.Cannot_open_dll "Failure(\"/tmp/build_0c8f14_dune/metappfc8229.cmxs: failed to map segment from shared object\")")
- (cd _build/default && .ppx/e17850eae66b6b5844e45f672bc501f8/ppx.exe --cookie 'library-name="metapp"' -o metapp/metapp.pp.mli --intf metapp/metapp.mli -corrected-suffix .ppx-corrected -diff-cmd - -dump-ast)
- File "_none_", line 1:
- Warning 58 [no-cmx-file]: no cmx file was found in path for module Metapp_api, and its interface was not compiled with -opaque
- File "_none_", line 1:
- Warning 58 [no-cmx-file]: no cmx file was found in path for module Metapp_version_info, and its interface was not compiled with -opaque
- File "_none_", line 1:
- Error: error loading shared library: Dynlink.Error (Dynlink.Cannot_open_dll "Failure(\"/tmp/build_0c8f14_dune/metappdcbdfe.cmxs: failed to map segment from shared object\")")
[ERROR] The compilation of metapp.0.4.4 failed at "dune build -p metapp -j 39 @install".
build failed... 

=== STDERR ===

2026-10-21 20:05.20: FAILED: build metapp.0.4.4
2026-10-21 20:05.20: Job failed: build failed: metapp.0.4.4