Build:
  1. 1
  2. 0
2026-10-21 18:54.48: New job: build metapp.0.4.4 (c19f872f1953)
2026-10-21 18:54.48: Waiting for resource in pool day11-builds
2026-10-21 19:46.02: Got resource from pool day11-builds
2026-10-21 19:46.02: [profile full] build metapp.0.4.4
2026-10-21 19:46.02: build metapp.0.4.4 (c19f872f1953)
=== DEPENDENCIES (13 transitive) ===
  base-threads.base                                  ca51096a9c5b
  base-unix.base                                     88a83b7ed333
  dune.3.24.2                                        855550871648
  ocaml.4.14.2                                       cbb67234c3a3
  ocaml-base-compiler.4.14.2                         832f26fb5f57
  ocaml-compiler-libs.v0.12.4                        b5b595dd7140
  ocaml-config.2                                     d03d16395a3f
  ocamlfind.1.9.8                                    f6cdbdc32ca2
  ppx_derivers.1.2.1                                 b59fce150bbd
  ppxlib.0.25.1                                      f26c169be0a8
  sexplib0.v0.17.0                                   b40a46f937e4
  stdcompat.21.1                                     1aaf8a6ef993
  stdlib-shims.0.3.0                                 2286699790f8
=== STDOUT ===
Processing: [default: loading data]
[metapp.0.4.4: dl]
[metapp.0.4.4: extract]
-> retrieved metapp.0.4.4  (https://opam.ocaml.org/cache)
[metapp: dune build]
+ /home/opam/.opam/default/bin/dune "build" "-p" "metapp" "-j" "39" "@install" (CWD=/home/opam/.opam/default/.opam-switch/build/metapp.0.4.4)
- File "metapp/dune", line 3, characters 14-30:
- 3 |   (preprocess (pps metapp.ppx))
-                   ^^^^^^^^^^^^^^^^
- (cd _build/default && .ppx/e17850eae66b6b5844e45f672bc501f8/ppx.exe --cookie 'library-name="metapp"' -o metapp/metapp.pp.mli --intf metapp/metapp.mli -corrected-suffix .ppx-corrected -diff-cmd - -dump-ast)
- findlib: [WARNING] Interface topdirs.cmi occurs in several directories: /home/opam/.opam/default/lib/ocaml, /home/opam/.opam/default/lib/ocaml/compiler-libs
- File "_none_", line 1:
- Warning 58 [no-cmx-file]: no cmx file was found in path for module Metapp_api, and its interface was not compiled with -opaque
- File "_none_", line 1:
- Warning 58 [no-cmx-file]: no cmx file was found in path for module Metapp_version_info, and its interface was not compiled with -opaque
- File "_none_", line 1:
- Error: error loading shared library: Dynlink.Error (Dynlink.Cannot_open_dll "Failure(\"/tmp/build_b230f7_dune/metappfad5e9.cmxs: failed to map segment from shared object\")")
- File "metapp/dune", line 3, characters 14-30:
- 3 |   (preprocess (pps metapp.ppx))
-                   ^^^^^^^^^^^^^^^^
- (cd _build/default && .ppx/e17850eae66b6b5844e45f672bc501f8/ppx.exe --cookie 'library-name="metapp"' -o metapp/metapp.pp.ml --impl metapp/metapp.ml -corrected-suffix .ppx-corrected -diff-cmd - -dump-ast)
- findlib: [WARNING] Interface topdirs.cmi occurs in several directories: /home/opam/.opam/default/lib/ocaml, /home/opam/.opam/default/lib/ocaml/compiler-libs
- File "_none_", line 1:
- Warning 58 [no-cmx-file]: no cmx file was found in path for module Metapp_api, and its interface was not compiled with -opaque
- File "_none_", line 1:
- Warning 58 [no-cmx-file]: no cmx file was found in path for module Metapp_preutils, and its interface was not compiled with -opaque
- File "_none_", line 1:
- Warning 58 [no-cmx-file]: no cmx file was found in path for module Metapp_version_info, and its interface was not compiled with -opaque
- File "_none_", line 1:
- Error: error loading shared library: Dynlink.Error (Dynlink.Cannot_open_dll "Failure(\"/tmp/build_b230f7_dune/metapp0bd158.cmxs: failed to map segment from shared object\")")
[ERROR] The compilation of metapp.0.4.4 failed at "dune build -p metapp -j 39 @install".
build failed... 

=== STDERR ===

2026-10-21 19:47.42: FAILED: build metapp.0.4.4
2026-10-21 19:47.42: Job failed: build failed: metapp.0.4.4