Build:
  1. 0
2026-10-21 18:17.17: New job: build srs.2.0.0 (2cdd3a273407)
2026-10-21 18:17.17: Waiting for resource in pool day11-builds
2026-10-21 18:43.20: Got resource from pool day11-builds
2026-10-21 18:43.20: [profile full] build srs.2.0.0
2026-10-21 18:43.20: build srs.2.0.0 (2cdd3a273407)
=== DEPENDENCIES (4 transitive) ===
  jbuilder.1.0+beta20.2                              60700b5f99e7
  ocaml.4.14.4                                       2cc549d6f8d5
  ocaml-base-compiler.4.14.4                         ecbd009faad9
  ocaml-config.2                                     c0047cbf7f6a
=== STDOUT ===
Processing: [default: loading data]
[srs.2.0.0: dl]
[srs.2.0.0: extract]
-> retrieved srs.2.0.0  (https://opam.ocaml.org/cache)
[srs: jbuilder build]
+ /home/opam/.opam/default/bin/jbuilder "build" "-p" "srs" "-j" "39" (CWD=/home/opam/.opam/default/.opam-switch/build/srs.2.0.0)
-       ocamlc src/srs_stubs.o (exit 2)
- (cd _build/default/src && /home/opam/.opam/default/bin/ocamlc.opt -g -ccopt -Wall -ccopt -Werror -o srs_stubs.o srs_stubs.c)
- srs_stubs.c:4:10: fatal error: srs2.h: No such file or directory
-     4 | #include <srs2.h>
-       |          ^~~~~~~~
- compilation terminated.
[ERROR] The compilation of srs.2.0.0 failed at "jbuilder build -p srs -j 39".
build failed... 

=== STDERR ===

2026-10-21 18:43.46: FAILED: build srs.2.0.0
2026-10-21 18:43.46: Job failed: build failed: srs.2.0.0