Build:
  1. 0
2026-10-08 06:12.20: New job: build frama-c.27.0~beta (5edce7941003)
2026-10-08 06:12.20: Waiting for resource in pool day11-builds
2026-10-08 14:14.30: Got resource from pool day11-builds
2026-10-08 14:14.30: [profile full] build frama-c.27.0~beta
2026-10-08 14:14.30: build frama-c.27.0~beta (5edce7941003)
=== DEPENDENCIES (67 transitive) ===
  alt-ergo-free.2.4.3                                350fa98c5163
  astring.0.8.5                                      1fdfe4769f58
  base-bigarray.base                                 dce7dd6b7cf9
  base-threads.base                                  464810371b96
  base-unix.base                                     4596d20d2cf7
  bos.0.3.0                                          171371ca97f4
  cairo2.0.6.5                                       274f1e61fe04
  camlp-streams.5.0.1                                5accc01a23b5
  camlzip.1.14                                       f03d58a91451
  cmdliner.1.3.0                                     46d480becbde
  conf-autoconf.1                                    8ee1e3913008
  conf-cairo.1                                       4ac6c3832bbf
  conf-gmp.5                                         c2adbec9a470
  conf-gtk3.18                                       6eedff6ed0e0
  conf-gtksourceview3.0+2                            89c25806d439
  conf-pkg-config.5                                  e39f7209b38f
  conf-zlib.1                                        ef4bfe5217f4
  cppo.1.8.0                                         7e479d02d230
  csexp.1.5.2                                        8b30afd89d08
  ctypes.0.24.0                                      6b9c190d7f32
  dune.3.23.1                                        c163af3a36d9
  dune-build-info.3.23.1                             6e7984af410c
  dune-configurator.3.23.1                           d9f46ec6c4fd
  dune-private-libs.3.23.1                           04881dc60335
  dune-site.3.23.1                                   7747bbd62eb4
  dyn.3.23.1                                         01f421e3e220
  fmt.0.11.0                                         bc851fa28063
  fpath.0.7.3                                        3078b5bb2085
  fs-io.3.23.1                                       5a173f8c14d5
  integers.0.8.0                                     9ada755b23e1
  lablgtk3.3.1.5                                     3f62aa9731e4
  lablgtk3-sourceview3.3.1.5                         aef13efd552b
  logs.0.10.0                                        59ca8b05923e
  menhir.20260209                                    5ad59faa8e5e
  menhirCST.20260209                                 f848bf1a0d4a
  menhirGLR.20260209                                 7859fbe5eb10
  menhirLib.20260209                                 284534d3dd0f
  menhirSdk.20260209                                 dd9b82f718bb
  num.1.6                                            16b90e766c5a
  ocaml.5.2.1                                        93faf5058139
  ocaml-base-compiler.5.2.1                          cb6dedff101a
  ocaml-compiler-libs.v0.17.0                        12fbbcd30e80
  ocaml-config.3                                     74db87359736
  ocamlbuild.0.16.1                                  50f5f0762031
  ocamlfind.1.9.8                                    e27058e572b5
  ocamlgraph.2.2.0                                   94fd938ccb50
  ocplib-simplex.0.4.1                               4902ecf30e35
  ordering.3.23.1                                    34c7b065bf6a
  pp.2.0.0                                           614aee710cbc
  ppx_derivers.1.2.1                                 39cc9350173f
  ppx_deriving.6.2.0                                 a75d9a5b4141
  ppx_deriving_yaml.0.5.0                            03154ed61766
  ppx_deriving_yojson.3.10.0                         17f38da64ba1
  ppx_import.1.12.0                                  37bb504b4560
  ppxlib.0.38.0                                      abdad920c361
  psmt2-frontend.0.4.0                               f8e06182f686
  rresult.0.7.0                                      aefabfd0f574
  seq.base                                           43fadf0daace
  sexplib0.v0.17.0                                   e2def2700014
  stdlib-shims.0.3.0                                 a4389b44f546
  stdune.3.23.1                                      775a635e3746
  top-closure.3.23.1                                 3c21b9918d97
  topkg.1.1.1                                        691afb68d819
  why3.1.6.0                                         58489dd15fda
  yaml.3.2.0                                         53df303b3ffb
  yojson.3.0.0                                       cea6ad7c7ef1
  zarith.1.14                                        1542706e8031
=== STDOUT ===
Processing: [default: loading data]
[frama-c.27.0~beta: dl]
[frama-c.27.0~beta: extract]
-> retrieved frama-c.27.0~beta  (https://opam.ocaml.org/cache)
[frama-c: dune build]
+ /home/opam/.opam/default/bin/dune "build" "-j39" "-p" "frama-c" "--promote-install-files=false" "@install" (CWD=/home/opam/.opam/default/.opam-switch/build/frama-c.27.0~beta)
- (cd _build/default && /home/opam/.opam/default/bin/ocamlc.opt -w -40 -w -9 -g -ppx '.ppx/e9e13696c34b3ab3095e50a7d8bfcf4c/ppx.exe --as-ppx --cookie '\''library-name="frama_c_kernel"'\''' -bin-annot -bin-annot-occurrences -I src/.frama_c_kernel.objs/byte -I /home/opam/.opam/default/lib/astring -I /home/opam/.opam/default/lib/bos -I /home/opam/.opam/default/lib/bytes -I /home/opam/.opam/default/lib/ctypes -I /home/opam/.opam/default/lib/ctypes/stubs -I /home/opam/.opam/default/lib/dune-private-libs/dune-section -I /home/opam/.opam/default/lib/dune-private-libs/meta_parser -I /home/opam/.opam/default/lib/dune-site -I /home/opam/.opam/default/lib/dune-site/linker -I /home/opam/.opam/default/lib/dune-site/plugins -I /home/opam/.opam/default/lib/dune-site/private -I /home/opam/.opam/default/lib/fmt -I /home/opam/.opam/default/lib/fpath -I /home/opam/.opam/default/lib/integers -I /home/opam/.opam/default/lib/logs -I /home/opam/.opam/default/lib/menhirLib -I /home/opam/.opam/default/lib/ocaml/dynlink -I /home/opam/.opam/default/lib/ocaml/str -I /home/opam/.opam/default/lib/ocaml/threads -I /home/opam/.opam/default/lib/ocaml/unix -I /home/opam/.opam/default/lib/ocamlgraph -I /home/opam/.opam/default/lib/ppx_deriving/runtime -I /home/opam/.opam/default/lib/ppx_deriving_yaml/runtime -I /home/opam/.opam/default/lib/ppx_deriving_yaml/types -I /home/opam/.opam/default/lib/stdlib-shims -I /home/opam/.opam/default/lib/yaml -I /home/opam/.opam/default/lib/yaml/bindings -I /home/opam/.opam/default/lib/yaml/bindings/types -I /home/opam/.opam/default/lib/yaml/c -I /home/opam/.opam/default/lib/yaml/ffi -I /home/opam/.opam/default/lib/yaml/types -I /home/opam/.opam/default/lib/yaml/unix -I /home/opam/.opam/default/lib/yojson -I /home/opam/.opam/default/lib/zarith -I src/init/.frama_c_very_first.objs/byte -cmi-file src/.frama_c_kernel.objs/byte/frama_c_kernel__Cmdline.cmi -no-alias-deps -open Frama_c_kernel -o src/.frama_c_kernel.objs/byte/frama_c_kernel__Cmdline.cmo -c -impl src/kernel_services/cmdline_parameters/cmdline.ml)
- File "src/kernel_services/cmdline_parameters/cmdline.ml", line 161, characters 30-40:
- 161 | module NormalExit = Hook.Make(struct end)
-                                     ^^^^^^^^^^
- Warning 73 [generative-application-expects-unit]: A generative functor
- should be applied to '()'; using '(struct end)' is deprecated.
- 
- File "src/kernel_services/cmdline_parameters/cmdline.ml", line 620, characters 23-33:
- 620 |   module H = Hook.Make(struct end)
-                              ^^^^^^^^^^
- Warning 73 [generative-application-expects-unit]: A generative functor
- should be applied to '()'; using '(struct end)' is deprecated.
- (cd _build/default && /home/opam/.opam/default/bin/ocamlc.opt -w -40 -w -9 -g -ppx '.ppx/e9e13696c34b3ab3095e50a7d8bfcf4c/ppx.exe --as-ppx --cookie '\''library-name="frama_c_kernel"'\''' -bin-annot -bin-annot-occurrences -I src/.frama_c_kernel.objs/byte -I /home/opam/.opam/default/lib/astring -I /home/opam/.opam/default/lib/bos -I /home/opam/.opam/default/lib/bytes -I /home/opam/.opam/default/lib/ctypes -I /home/opam/.opam/default/lib/ctypes/stubs -I /home/opam/.opam/default/lib/dune-private-libs/dune-section -I /home/opam/.opam/default/lib/dune-private-libs/meta_parser -I /home/opam/.opam/default/lib/dune-site -I /home/opam/.opam/default/lib/dune-site/linker -I /home/opam/.opam/default/lib/dune-site/plugins -I /home/opam/.opam/default/lib/dune-site/private -I /home/opam/.opam/default/lib/fmt -I /home/opam/.opam/default/lib/fpath -I /home/opam/.opam/default/lib/integers -I /home/opam/.opam/default/lib/logs -I /home/opam/.opam/default/lib/menhirLib -I /home/opam/.opam/default/lib/ocaml/dynlink -I /home/opam/.opam/default/lib/ocaml/str -I /home/opam/.opam/default/lib/ocaml/threads -I /home/opam/.opam/default/lib/ocaml/unix -I /home/opam/.opam/default/lib/ocamlgraph -I /home/opam/.opam/default/lib/ppx_deriving/runtime -I /home/opam/.opam/default/lib/ppx_deriving_yaml/runtime -I /home/opam/.opam/default/lib/ppx_deriving_yaml/types -I /home/opam/.opam/default/lib/stdlib-shims -I /home/opam/.opam/default/lib/yaml -I /home/opam/.opam/default/lib/yaml/bindings -I /home/opam/.opam/default/lib/yaml/bindings/types -I /home/opam/.opam/default/lib/yaml/c -I /home/opam/.opam/default/lib/yaml/ffi -I /home/opam/.opam/default/lib/yaml/types -I /home/opam/.opam/default/lib/yaml/unix -I /home/opam/.opam/default/lib/yojson -I /home/opam/.opam/default/lib/zarith -I src/init/.frama_c_very_first.objs/byte -cmi-file src/.frama_c_kernel.objs/byte/frama_c_kernel__Project.cmi -no-alias-deps -open Frama_c_kernel -o src/.frama_c_kernel.objs/byte/frama_c_kernel__Project.cmo -c -impl src/libraries/project/project.ml)
- File "src/libraries/project/project.ml", line 438, characters 31-41:
- 438 | module Before_load = Hook.Make(struct end)
-                                      ^^^^^^^^^^
- Warning 73 [generative-application-expects-unit]: A generative functor
- should be applied to '()'; using '(struct end)' is deprecated.
- 
- File "src/libraries/project/project.ml", line 441, characters 30-40:
- 441 | module After_load = Hook.Make(struct end)
-                                     ^^^^^^^^^^
- Warning 73 [generative-application-expects-unit]: A generative functor
- should be applied to '()'; using '(struct end)' is deprecated.
- 
- File "src/libraries/project/project.ml", line 444, characters 37-47:
- 444 | module After_global_load = Hook.Make(struct end)
-                                            ^^^^^^^^^^
- Warning 73 [generative-application-expects-unit]: A generative functor
- should be applied to '()'; using '(struct end)' is deprecated.
- (cd _build/default && /home/opam/.opam/default/bin/ocamlopt.opt -w -40 -w -9 -g -ppx '.ppx/e9e13696c34b3ab3095e50a7d8bfcf4c/ppx.exe --as-ppx --cookie '\''library-name="frama_c_kernel"'\''' -I src/.frama_c_kernel.objs/byte -I src/.frama_c_kernel.objs/native -I /home/opam/.opam/default/lib/astring -I /home/opam/.opam/default/lib/bos -I /home/opam/.opam/default/lib/bytes -I /home/opam/.opam/default/lib/ctypes -I /home/opam/.opam/default/lib/ctypes/stubs -I /home/opam/.opam/default/lib/dune-private-libs/dune-section -I /home/opam/.opam/default/lib/dune-private-libs/meta_parser -I /home/opam/.opam/default/lib/dune-site -I /home/opam/.opam/default/lib/dune-site/linker -I /home/opam/.opam/default/lib/dune-site/plugins -I /home/opam/.opam/default/lib/dune-site/private -I /home/opam/.opam/default/lib/fmt -I /home/opam/.opam/default/lib/fpath -I /home/opam/.opam/default/lib/integers -I /home/opam/.opam/default/lib/logs -I /home/opam/.opam/default/lib/menhirLib -I /home/opam/.opam/default/lib/ocaml/dynlink -I /home/opam/.opam/default/lib/ocaml/str -I /home/opam/.opam/default/lib/ocaml/threads -I /home/opam/.opam/default/lib/ocaml/unix -I /home/opam/.opam/default/lib/ocamlgraph -I /home/opam/.opam/default/lib/ppx_deriving/runtime -I /home/opam/.opam/default/lib/ppx_deriving_yaml/runtime -I /home/opam/.opam/default/lib/ppx_deriving_yaml/types -I /home/opam/.opam/default/lib/stdlib-shims -I /home/opam/.opam/default/lib/yaml -I /home/opam/.opam/default/lib/yaml/bindings -I /home/opam/.opam/default/lib/yaml/bindings/types -I /home/opam/.opam/default/lib/yaml/c -I /home/opam/.opam/default/lib/yaml/ffi -I /home/opam/.opam/default/lib/yaml/types -I /home/opam/.opam/default/lib/yaml/unix -I /home/opam/.opam/default/lib/yojson -I /home/opam/.opam/default/lib/zarith -I src/init/.frama_c_very_first.objs/byte -I src/init/.frama_c_very_first.objs/native -cmi-file src/.frama_c_kernel.objs/byte/frama_c_kernel__Cmdline.cmi -no-alias-deps -open Frama_c_kernel -o src/.frama_c_kernel.objs/native/frama_c_kernel__Cmdline.cmx -c -impl src/kernel_services/cmdline_parameters/cmdline.ml)
- File "src/kernel_services/cmdline_parameters/cmdline.ml", line 161, characters 30-40:
- 161 | module NormalExit = Hook.Make(struct end)
-                                     ^^^^^^^^^^
- Warning 73 [generative-application-expects-unit]: A generative functor
- should be applied to '()'; using '(struct end)' is deprecated.
- 
- File "src/kernel_services/cmdline_parameters/cmdline.ml", line 620, characters 23-33:
- 620 |   module H = Hook.Make(struct end)
-                              ^^^^^^^^^^
- Warning 73 [generative-application-expects-unit]: A generative functor
- should be applied to '()'; using '(struct end)' is deprecated.
- (cd _build/default && /home/opam/.opam/default/bin/ocamlc.opt -w -40 -w -9 -g -ppx '.ppx/e9e13696c34b3ab3095e50a7d8bfcf4c/ppx.exe --as-ppx --cookie '\''library-name="frama_c_kernel"'\''' -bin-annot -bin-annot-occurrences -I src/.frama_c_kernel.objs/byte -I /home/opam/.opam/default/lib/astring -I /home/opam/.opam/default/lib/bos -I /home/opam/.opam/default/lib/bytes -I /home/opam/.opam/default/lib/ctypes -I /home/opam/.opam/default/lib/ctypes/stubs -I /home/opam/.opam/default/lib/dune-private-libs/dune-section -I /home/opam/.opam/default/lib/dune-private-libs/meta_parser -I /home/opam/.opam/default/lib/dune-site -I /home/opam/.opam/default/lib/dune-site/linker -I /home/opam/.opam/default/lib/dune-site/plugins -I /home/opam/.opam/default/lib/dune-site/private -I /home/opam/.opam/default/lib/fmt -I /home/opam/.opam/default/lib/fpath -I /home/opam/.opam/default/lib/integers -I /home/opam/.opam/default/lib/logs -I /home/opam/.opam/default/lib/menhirLib -I /home/opam/.opam/default/lib/ocaml/dynlink -I /home/opam/.opam/default/lib/ocaml/str -I /home/opam/.opam/default/lib/ocaml/threads -I /home/opam/.opam/default/lib/ocaml/unix -I /home/opam/.opam/default/lib/ocamlgraph -I /home/opam/.opam/default/lib/ppx_deriving/runtime -I /home/opam/.opam/default/lib/ppx_deriving_yaml/runtime -I /home/opam/.opam/default/lib/ppx_deriving_yaml/types -I /home/opam/.opam/default/lib/stdlib-shims -I /home/opam/.opam/default/lib/yaml -I /home/opam/.opam/default/lib/yaml/bindings -I /home/opam/.opam/default/lib/yaml/bindings/types -I /home/opam/.opam/default/lib/yaml/c -I /home/opam/.opam/default/lib/yaml/ffi -I /home/opam/.opam/default/lib/yaml/types -I /home/opam/.opam/default/lib/yaml/unix -I /home/opam/.opam/default/lib/yojson -I /home/opam/.opam/default/lib/zarith -I src/init/.frama_c_very_first.objs/byte -cmi-file src/.frama_c_kernel.objs/byte/frama_c_kernel__Logic_env.cmi -no-alias-deps -open Frama_c_kernel -o src/.frama_c_kernel.objs/byte/frama_c_kernel__Logic_env.cmo -c -impl src/kernel_services/ast_queries/logic_env.ml)
- File "src/kernel_services/ast_queries/logic_env.ml", line 320, characters 20-30:
- 320 |   include Hook.Make(struct end)
-                           ^^^^^^^^^^
- Warning 73 [generative-application-expects-unit]: A generative functor
- should be applied to '()'; using '(struct end)' is deprecated.
- (cd _build/default && /home/opam/.opam/default/bin/ocamlopt.opt -w -40 -w -9 -g -ppx '.ppx/e9e13696c34b3ab3095e50a7d8bfcf4c/ppx.exe --as-ppx --cookie '\''library-name="frama_c_kernel"'\''' -I src/.frama_c_kernel.objs/byte -I src/.frama_c_kernel.objs/native -I /home/opam/.opam/default/lib/astring -I /home/opam/.opam/default/lib/bos -I /home/opam/.opam/default/lib/bytes -I /home/opam/.opam/default/lib/ctypes -I /home/opam/.opam/default/lib/ctypes/stubs -I /home/opam/.opam/default/lib/dune-private-libs/dune-section -I /home/opam/.opam/default/lib/dune-private-libs/meta_parser -I /home/opam/.opam/default/lib/dune-site -I /home/opam/.opam/default/lib/dune-site/linker -I /home/opam/.opam/default/lib/dune-site/plugins -I /home/opam/.opam/default/lib/dune-site/private -I /home/opam/.opam/default/lib/fmt -I /home/opam/.opam/default/lib/fpath -I /home/opam/.opam/default/lib/integers -I /home/opam/.opam/default/lib/logs -I /home/opam/.opam/default/lib/menhirLib -I /home/opam/.opam/default/lib/ocaml/dynlink -I /home/opam/.opam/default/lib/ocaml/str -I /home/opam/.opam/default/lib/ocaml/threads -I /home/opam/.opam/default/lib/ocaml/unix -I /home/opam/.opam/default/lib/ocamlgraph -I /home/opam/.opam/default/lib/ppx_deriving/runtime -I /home/opam/.opam/default/lib/ppx_deriving_yaml/runtime -I /home/opam/.opam/default/lib/ppx_deriving_yaml/types -I /home/opam/.opam/default/lib/stdlib-shims -I /home/opam/.opam/default/lib/yaml -I /home/opam/.opam/default/lib/yaml/bindings -I /home/opam/.opam/default/lib/yaml/bindings/types -I /home/opam/.opam/default/lib/yaml/c -I /home/opam/.opam/default/lib/yaml/ffi -I /home/opam/.opam/default/lib/yaml/types -I /home/opam/.opam/default/lib/yaml/unix -I /home/opam/.opam/default/lib/yojson -I /home/opam/.opam/default/lib/zarith -I src/init/.frama_c_very_first.objs/byte -I src/init/.frama_c_very_first.objs/native -cmi-file src/.frama_c_kernel.objs/byte/frama_c_kernel__Project.cmi -no-alias-deps -open Frama_c_kernel -o src/.frama_c_kernel.objs/native/frama_c_kernel__Project.cmx -c -impl src/libraries/project/project.ml)
- File "src/libraries/project/project.ml", line 438, characters 31-41:
- 438 | module Before_load = Hook.Make(struct end)
-                                      ^^^^^^^^^^
- Warning 73 [generative-application-expects-unit]: A generative functor
- should be applied to '()'; using '(struct end)' is deprecated.
- 
- File "src/libraries/project/project.ml", line 441, characters 30-40:
- 441 | module After_load = Hook.Make(struct end)
-                                     ^^^^^^^^^^
- Warning 73 [generative-application-expects-unit]: A generative functor
- should be applied to '()'; using '(struct end)' is deprecated.
- 
- File "src/libraries/project/project.ml", line 444, characters 37-47:
- 444 | module After_global_load = Hook.Make(struct end)
-                                            ^^^^^^^^^^
- Warning 73 [generative-application-expects-unit]: A generative functor
- should be applied to '()'; using '(struct end)' is deprecated.
- (cd _build/default && /home/opam/.opam/default/bin/ocamlc.opt -w -40 -w -9 -g -ppx '.ppx/e9e13696c34b3ab3095e50a7d8bfcf4c/ppx.exe --as-ppx --cookie '\''library-name="frama_c_kernel"'\''' -bin-annot -bin-annot-occurrences -I src/.frama_c_kernel.objs/byte -I /home/opam/.opam/default/lib/astring -I /home/opam/.opam/default/lib/bos -I /home/opam/.opam/default/lib/bytes -I /home/opam/.opam/default/lib/ctypes -I /home/opam/.opam/default/lib/ctypes/stubs -I /home/opam/.opam/default/lib/dune-private-libs/dune-section -I /home/opam/.opam/default/lib/dune-private-libs/meta_parser -I /home/opam/.opam/default/lib/dune-site -I /home/opam/.opam/default/lib/dune-site/linker -I /home/opam/.opam/default/lib/dune-site/plugins -I /home/opam/.opam/default/lib/dune-site/private -I /home/opam/.opam/default/lib/fmt -I /home/opam/.opam/default/lib/fpath -I /home/opam/.opam/default/lib/integers -I /home/opam/.opam/default/lib/logs -I /home/opam/.opam/default/lib/menhirLib -I /home/opam/.opam/default/lib/ocaml/dynlink -I /home/opam/.opam/default/lib/ocaml/str -I /home/opam/.opam/default/lib/ocaml/threads -I /home/opam/.opam/default/lib/ocaml/unix -I /home/opam/.opam/default/lib/ocamlgraph -I /home/opam/.opam/default/lib/ppx_deriving/runtime -I /home/opam/.opam/default/lib/ppx_deriving_yaml/runtime -I /home/opam/.opam/default/lib/ppx_deriving_yaml/types -I /home/opam/.opam/default/lib/stdlib-shims -I /home/opam/.opam/default/lib/yaml -I /home/opam/.opam/default/lib/yaml/bindings -I /home/opam/.opam/default/lib/yaml/bindings/types -I /home/opam/.opam/default/lib/yaml/c -I /home/opam/.opam/default/lib/yaml/ffi -I /home/opam/.opam/default/lib/yaml/types -I /home/opam/.opam/default/lib/yaml/unix -I /home/opam/.opam/default/lib/yojson -I /home/opam/.opam/default/lib/zarith -I src/init/.frama_c_very_first.objs/byte -cmi-file src/.frama_c_kernel.objs/byte/frama_c_kernel__Db.cmi -no-alias-deps -open Frama_c_kernel -o src/.frama_c_kernel.objs/byte/frama_c_kernel__Db.cmo -c -impl src/kernel_services/plugin_entry_points/db.ml)
- File "src/kernel_services/plugin_entry_points/db.ml", line 40, characters 20-30:
- 40 |   include Hook.Make(struct end)
-                          ^^^^^^^^^^
- Warning 73 [generative-application-expects-unit]: A generative functor
- should be applied to '()'; using '(struct end)' is deprecated.
- (cd _build/default && /home/opam/.opam/default/bin/ocamlc.opt -open Frama_c_kernel -linkall -w -40 -w -9 -g -bin-annot -bin-annot-occurrences -I src/plugins/gui/.frama_c_gui.objs/byte -I /home/opam/.opam/default/lib/astring -I /home/opam/.opam/default/lib/bos -I /home/opam/.opam/default/lib/bytes -I /home/opam/.opam/default/lib/cairo2 -I /home/opam/.opam/default/lib/ctypes -I /home/opam/.opam/default/lib/ctypes/stubs -I /home/opam/.opam/default/lib/dune-private-libs/dune-section -I /home/opam/.opam/default/lib/dune-private-libs/meta_parser -I /home/opam/.opam/default/lib/dune-site -I /home/opam/.opam/default/lib/dune-site/linker -I /home/opam/.opam/default/lib/dune-site/plugins -I /home/opam/.opam/default/lib/dune-site/private -I /home/opam/.opam/default/lib/fmt -I /home/opam/.opam/default/lib/fpath -I /home/opam/.opam/default/lib/integers -I /home/opam/.opam/default/lib/lablgtk3 -I /home/opam/.opam/default/lib/lablgtk3-sourceview3 -I /home/opam/.opam/default/lib/logs -I /home/opam/.opam/default/lib/menhirLib -I /home/opam/.opam/default/lib/ocaml/dynlink -I /home/opam/.opam/default/lib/ocaml/str -I /home/opam/.opam/default/lib/ocaml/threads -I /home/opam/.opam/default/lib/ocaml/unix -I /home/opam/.opam/default/lib/ocamlgraph -I /home/opam/.opam/default/lib/ppx_deriving/runtime -I /home/opam/.opam/default/lib/ppx_deriving_yaml/runtime -I /home/opam/.opam/default/lib/ppx_deriving_yaml/types -I /home/opam/.opam/default/lib/stdlib-shims -I /home/opam/.opam/default/lib/yaml -I /home/opam/.opam/default/lib/yaml/bindings -I /home/opam/.opam/default/lib/yaml/bindings/types -I /home/opam/.opam/default/lib/yaml/c -I /home/opam/.opam/default/lib/yaml/ffi -I /home/opam/.opam/default/lib/yaml/types -I /home/opam/.opam/default/lib/yaml/unix -I /home/opam/.opam/default/lib/yojson -I /home/opam/.opam/default/lib/zarith -I src/.frama_c_kernel.objs/byte -I src/init/.frama_c_very_first.objs/byte -I src/init/impl_gui/.frama_c_very_first_gui.objs/byte -cmi-file src/plugins/gui/.frama_c_gui.objs/byte/frama_c_gui__Launcher.cmi -no-alias-deps -open Frama_c_gui -o src/plugins/gui/.frama_c_gui.objs/byte/frama_c_gui__Launcher.cmo -c -impl src/plugins/gui/launcher.ml)
- File "src/plugins/gui/launcher.ml", line 25, characters 31-41:
- 25 | module Kernel_hook = Hook.Make(struct end)
-                                     ^^^^^^^^^^
- Warning 73 [generative-application-expects-unit]: A generative functor
- should be applied to '()'; using '(struct end)' is deprecated.
- (cd _build/default && /home/opam/.opam/default/bin/ocamlc.opt -open Frama_c_kernel -linkall -w -40 -w -9 -g -bin-annot -bin-annot-occurrences -I src/plugins/gui/.frama_c_gui.objs/byte -I /home/opam/.opam/default/lib/astring -I /home/opam/.opam/default/lib/bos -I /home/opam/.opam/default/lib/bytes -I /home/opam/.opam/default/lib/cairo2 -I /home/opam/.opam/default/lib/ctypes -I /home/opam/.opam/default/lib/ctypes/stubs -I /home/opam/.opam/default/lib/dune-private-libs/dune-section -I /home/opam/.opam/default/lib/dune-private-libs/meta_parser -I /home/opam/.opam/default/lib/dune-site -I /home/opam/.opam/default/lib/dune-site/linker -I /home/opam/.opam/default/lib/dune-site/plugins -I /home/opam/.opam/default/lib/dune-site/private -I /home/opam/.opam/default/lib/fmt -I /home/opam/.opam/default/lib/fpath -I /home/opam/.opam/default/lib/integers -I /home/opam/.opam/default/lib/lablgtk3 -I /home/opam/.opam/default/lib/lablgtk3-sourceview3 -I /home/opam/.opam/default/lib/logs -I /home/opam/.opam/default/lib/menhirLib -I /home/opam/.opam/default/lib/ocaml/dynlink -I /home/opam/.opam/default/lib/ocaml/str -I /home/opam/.opam/default/lib/ocaml/threads -I /home/opam/.opam/default/lib/ocaml/unix -I /home/opam/.opam/default/lib/ocamlgraph -I /home/opam/.opam/default/lib/ppx_deriving/runtime -I /home/opam/.opam/default/lib/ppx_deriving_yaml/runtime -I /home/opam/.opam/default/lib/ppx_deriving_yaml/types -I /home/opam/.opam/default/lib/stdlib-shims -I /home/opam/.opam/default/lib/yaml -I /home/opam/.opam/default/lib/yaml/bindings -I /home/opam/.opam/default/lib/yaml/bindings/types -I /home/opam/.opam/default/lib/yaml/c -I /home/opam/.opam/default/lib/yaml/ffi -I /home/opam/.opam/default/lib/yaml/types -I /home/opam/.opam/default/lib/yaml/unix -I /home/opam/.opam/default/lib/yojson -I /home/opam/.opam/default/lib/zarith -I src/.frama_c_kernel.objs/byte -I src/init/.frama_c_very_first.objs/byte -I src/init/impl_gui/.frama_c_very_first_gui.objs/byte -cmi-file src/plugins/gui/.frama_c_gui.objs/byte/frama_c_gui__Gtk_helper.cmi -no-alias-deps -open Frama_c_gui -o src/plugins/gui/.frama_c_gui.objs/byte/frama_c_gui__Gtk_helper.cmo -c -impl src/plugins/gui/gtk_helper.ml)
- File "src/plugins/gui/gtk_helper.ml", line 290, characters 23-33:
- 290 |   module H = Hook.Make(struct end)
-                              ^^^^^^^^^^
- Warning 73 [generative-application-expects-unit]: A generative functor
- should be applied to '()'; using '(struct end)' is deprecated.
- (cd _build/default && /home/opam/.opam/default/bin/ocamlopt.opt -w -40 -w -9 -g -ppx '.ppx/e9e13696c34b3ab3095e50a7d8bfcf4c/ppx.exe --as-ppx --cookie '\''library-name="frama_c_kernel"'\''' -I src/.frama_c_kernel.objs/byte -I src/.frama_c_kernel.objs/native -I /home/opam/.opam/default/lib/astring -I /home/opam/.opam/default/lib/bos -I /home/opam/.opam/default/lib/bytes -I /home/opam/.opam/default/lib/ctypes -I /home/opam/.opam/default/lib/ctypes/stubs -I /home/opam/.opam/default/lib/dune-private-libs/dune-section -I /home/opam/.opam/default/lib/dune-private-libs/meta_parser -I /home/opam/.opam/default/lib/dune-site -I /home/opam/.opam/default/lib/dune-site/linker -I /home/opam/.opam/default/lib/dune-site/plugins -I /home/opam/.opam/default/lib/dune-site/private -I /home/opam/.opam/default/lib/fmt -I /home/opam/.opam/default/lib/fpath -I /home/opam/.opam/default/lib/integers -I /home/opam/.opam/default/lib/logs -I /home/opam/.opam/default/lib/menhirLib -I /home/opam/.opam/default/lib/ocaml/dynlink -I /home/opam/.opam/default/lib/ocaml/str -I /home/opam/.opam/default/lib/ocaml/threads -I /home/opam/.opam/default/lib/ocaml/unix -I /home/opam/.opam/default/lib/ocamlgraph -I /home/opam/.opam/default/lib/ppx_deriving/runtime -I /home/opam/.opam/default/lib/ppx_deriving_yaml/runtime -I /home/opam/.opam/default/lib/ppx_deriving_yaml/types -I /home/opam/.opam/default/lib/stdlib-shims -I /home/opam/.opam/default/lib/yaml -I /home/opam/.opam/default/lib/yaml/bindings -I /home/opam/.opam/default/lib/yaml/bindings/types -I /home/opam/.opam/default/lib/yaml/c -I /home/opam/.opam/default/lib/yaml/ffi -I /home/opam/.opam/default/lib/yaml/types -I /home/opam/.opam/default/lib/yaml/unix -I /home/opam/.opam/default/lib/yojson -I /home/opam/.opam/default/lib/zarith -I src/init/.frama_c_very_first.objs/byte -I src/init/.frama_c_very_first.objs/native -cmi-file src/.frama_c_kernel.objs/byte/frama_c_kernel__Logic_env.cmi -no-alias-deps -open Frama_c_kernel -o src/.frama_c_kernel.objs/native/frama_c_kernel__Logic_env.cmx -c -impl src/kernel_services/ast_queries/logic_env.ml)
- File "src/kernel_services/ast_queries/logic_env.ml", line 320, characters 20-30:
- 320 |   include Hook.Make(struct end)
-                           ^^^^^^^^^^
- Warning 73 [generative-application-expects-unit]: A generative functor
- should be applied to '()'; using '(struct end)' is deprecated.
- (cd _build/default && /home/opam/.opam/default/bin/ocamlopt.opt -w -40 -w -9 -g -ppx '.ppx/e9e13696c34b3ab3095e50a7d8bfcf4c/ppx.exe --as-ppx --cookie '\''library-name="frama_c_kernel"'\''' -I src/.frama_c_kernel.objs/byte -I src/.frama_c_kernel.objs/native -I /home/opam/.opam/default/lib/astring -I /home/opam/.opam/default/lib/bos -I /home/opam/.opam/default/lib/bytes -I /home/opam/.opam/default/lib/ctypes -I /home/opam/.opam/default/lib/ctypes/stubs -I /home/opam/.opam/default/lib/dune-private-libs/dune-section -I /home/opam/.opam/default/lib/dune-private-libs/meta_parser -I /home/opam/.opam/default/lib/dune-site -I /home/opam/.opam/default/lib/dune-site/linker -I /home/opam/.opam/default/lib/dune-site/plugins -I /home/opam/.opam/default/lib/dune-site/private -I /home/opam/.opam/default/lib/fmt -I /home/opam/.opam/default/lib/fpath -I /home/opam/.opam/default/lib/integers -I /home/opam/.opam/default/lib/logs -I /home/opam/.opam/default/lib/menhirLib -I /home/opam/.opam/default/lib/ocaml/dynlink -I /home/opam/.opam/default/lib/ocaml/str -I /home/opam/.opam/default/lib/ocaml/threads -I /home/opam/.opam/default/lib/ocaml/unix -I /home/opam/.opam/default/lib/ocamlgraph -I /home/opam/.opam/default/lib/ppx_deriving/runtime -I /home/opam/.opam/default/lib/ppx_deriving_yaml/runtime -I /home/opam/.opam/default/lib/ppx_deriving_yaml/types -I /home/opam/.opam/default/lib/stdlib-shims -I /home/opam/.opam/default/lib/yaml -I /home/opam/.opam/default/lib/yaml/bindings -I /home/opam/.opam/default/lib/yaml/bindings/types -I /home/opam/.opam/default/lib/yaml/c -I /home/opam/.opam/default/lib/yaml/ffi -I /home/opam/.opam/default/lib/yaml/types -I /home/opam/.opam/default/lib/yaml/unix -I /home/opam/.opam/default/lib/yojson -I /home/opam/.opam/default/lib/zarith -I src/init/.frama_c_very_first.objs/byte -I src/init/.frama_c_very_first.objs/native -cmi-file src/.frama_c_kernel.objs/byte/frama_c_kernel__Db.cmi -no-alias-deps -open Frama_c_kernel -o src/.frama_c_kernel.objs/native/frama_c_kernel__Db.cmx -c -impl src/kernel_services/plugin_entry_points/db.ml)
- File "src/kernel_services/plugin_entry_points/db.ml", line 40, characters 20-30:
- 40 |   include Hook.Make(struct end)
-                          ^^^^^^^^^^
- Warning 73 [generative-application-expects-unit]: A generative functor
- should be applied to '()'; using '(struct end)' is deprecated.
- (cd _build/default && /home/opam/.opam/default/bin/ocamlopt.opt -open Frama_c_kernel -linkall -w -40 -w -9 -g -I src/plugins/gui/.frama_c_gui.objs/byte -I src/plugins/gui/.frama_c_gui.objs/native -I /home/opam/.opam/default/lib/astring -I /home/opam/.opam/default/lib/bos -I /home/opam/.opam/default/lib/bytes -I /home/opam/.opam/default/lib/cairo2 -I /home/opam/.opam/default/lib/ctypes -I /home/opam/.opam/default/lib/ctypes/stubs -I /home/opam/.opam/default/lib/dune-private-libs/dune-section -I /home/opam/.opam/default/lib/dune-private-libs/meta_parser -I /home/opam/.opam/default/lib/dune-site -I /home/opam/.opam/default/lib/dune-site/linker -I /home/opam/.opam/default/lib/dune-site/plugins -I /home/opam/.opam/default/lib/dune-site/private -I /home/opam/.opam/default/lib/fmt -I /home/opam/.opam/default/lib/fpath -I /home/opam/.opam/default/lib/integers -I /home/opam/.opam/default/lib/lablgtk3 -I /home/opam/.opam/default/lib/lablgtk3-sourceview3 -I /home/opam/.opam/default/lib/logs -I /home/opam/.opam/default/lib/menhirLib -I /home/opam/.opam/default/lib/ocaml/dynlink -I /home/opam/.opam/default/lib/ocaml/str -I /home/opam/.opam/default/lib/ocaml/threads -I /home/opam/.opam/default/lib/ocaml/unix -I /home/opam/.opam/default/lib/ocamlgraph -I /home/opam/.opam/default/lib/ppx_deriving/runtime -I /home/opam/.opam/default/lib/ppx_deriving_yaml/runtime -I /home/opam/.opam/default/lib/ppx_deriving_yaml/types -I /home/opam/.opam/default/lib/stdlib-shims -I /home/opam/.opam/default/lib/yaml -I /home/opam/.opam/default/lib/yaml/bindings -I /home/opam/.opam/default/lib/yaml/bindings/types -I /home/opam/.opam/default/lib/yaml/c -I /home/opam/.opam/default/lib/yaml/ffi -I /home/opam/.opam/default/lib/yaml/types -I /home/opam/.opam/default/lib/yaml/unix -I /home/opam/.opam/default/lib/yojson -I /home/opam/.opam/default/lib/zarith -I src/.frama_c_kernel.objs/byte -I src/.frama_c_kernel.objs/native -I src/init/.frama_c_very_first.objs/byte -I src/init/.frama_c_very_first.objs/native -I src/init/impl_gui/.frama_c_very_first_gui.objs/byte -I src/init/impl_gui/.frama_c_very_first_gui.objs/native -cmi-file src/plugins/gui/.frama_c_gui.objs/byte/frama_c_gui__Gtk_helper.cmi -no-alias-deps -open Frama_c_gui -o src/plugins/gui/.frama_c_gui.objs/native/frama_c_gui__Gtk_helper.cmx -c -impl src/plugins/gui/gtk_helper.ml)
- File "src/plugins/gui/gtk_helper.ml", line 290, characters 23-33:
- 290 |   module H = Hook.Make(struct end)
-                              ^^^^^^^^^^
- Warning 73 [generative-application-expects-unit]: A generative functor
- should be applied to '()'; using '(struct end)' is deprecated.
- (cd _build/default && /home/opam/.opam/default/bin/ocamlopt.opt -open Frama_c_kernel -linkall -w -40 -w -9 -g -I src/plugins/gui/.frama_c_gui.objs/byte -I src/plugins/gui/.frama_c_gui.objs/native -I /home/opam/.opam/default/lib/astring -I /home/opam/.opam/default/lib/bos -I /home/opam/.opam/default/lib/bytes -I /home/opam/.opam/default/lib/cairo2 -I /home/opam/.opam/default/lib/ctypes -I /home/opam/.opam/default/lib/ctypes/stubs -I /home/opam/.opam/default/lib/dune-private-libs/dune-section -I /home/opam/.opam/default/lib/dune-private-libs/meta_parser -I /home/opam/.opam/default/lib/dune-site -I /home/opam/.opam/default/lib/dune-site/linker -I /home/opam/.opam/default/lib/dune-site/plugins -I /home/opam/.opam/default/lib/dune-site/private -I /home/opam/.opam/default/lib/fmt -I /home/opam/.opam/default/lib/fpath -I /home/opam/.opam/default/lib/integers -I /home/opam/.opam/default/lib/lablgtk3 -I /home/opam/.opam/default/lib/lablgtk3-sourceview3 -I /home/opam/.opam/default/lib/logs -I /home/opam/.opam/default/lib/menhirLib -I /home/opam/.opam/default/lib/ocaml/dynlink -I /home/opam/.opam/default/lib/ocaml/str -I /home/opam/.opam/default/lib/ocaml/threads -I /home/opam/.opam/default/lib/ocaml/unix -I /home/opam/.opam/default/lib/ocamlgraph -I /home/opam/.opam/default/lib/ppx_deriving/runtime -I /home/opam/.opam/default/lib/ppx_deriving_yaml/runtime -I /home/opam/.opam/default/lib/ppx_deriving_yaml/types -I /home/opam/.opam/default/lib/stdlib-shims -I /home/opam/.opam/default/lib/yaml -I /home/opam/.opam/default/lib/yaml/bindings -I /home/opam/.opam/default/lib/yaml/bindings/types -I /home/opam/.opam/default/lib/yaml/c -I /home/opam/.opam/default/lib/yaml/ffi -I /home/opam/.opam/default/lib/yaml/types -I /home/opam/.opam/default/lib/yaml/unix -I /home/opam/.opam/default/lib/yojson -I /home/opam/.opam/default/lib/zarith -I src/.frama_c_kernel.objs/byte -I src/.frama_c_kernel.objs/native -I src/init/.frama_c_very_first.objs/byte -I src/init/.frama_c_very_first.objs/native -I src/init/impl_gui/.frama_c_very_first_gui.objs/byte -I src/init/impl_gui/.frama_c_very_first_gui.objs/native -cmi-file src/plugins/gui/.frama_c_gui.objs/byte/frama_c_gui__Launcher.cmi -no-alias-deps -open Frama_c_gui -o src/plugins/gui/.frama_c_gui.objs/native/frama_c_gui__Launcher.cmx -c -impl src/plugins/gui/launcher.ml)
- File "src/plugins/gui/launcher.ml", line 25, characters 31-41:
- 25 | module Kernel_hook = Hook.Make(struct end)
-                                     ^^^^^^^^^^
- Warning 73 [generative-application-expects-unit]: A generative functor
- should be applied to '()'; using '(struct end)' is deprecated.
-> compiled  frama-c.27.0~beta
[frama-c: make install]
+ /usr/bin/make "PREFIX=/home/opam/.opam/default" "MANDIR=" "install" (CWD=/home/opam/.opam/default/.opam-switch/build/frama-c.27.0~beta)
- CC           dlmalloc.c
- AR           libeacsl-dlmalloc.a
- RANLIB       libeacsl-dlmalloc.a
- ar: `u' modifier ignored since `D' is the default (see `U')
- File "src/kernel_services/cmdline_parameters/cmdline.ml", line 161, characters 30-40:
- 161 | module NormalExit = Hook.Make(struct end)
-                                     ^^^^^^^^^^
- Warning 73 [generative-application-expects-unit]: A generative functor
- should be applied to '()'; using '(struct end)' is deprecated.
- 
- File "src/kernel_services/cmdline_parameters/cmdline.ml", line 620, characters 23-33:
- 620 |   module H = Hook.Make(struct end)
-                              ^^^^^^^^^^
- Warning 73 [generative-application-expects-unit]: A generative functor
- should be applied to '()'; using '(struct end)' is deprecated.
- File "src/kernel_services/cmdline_parameters/cmdline.ml", line 161, characters 30-40:
- 161 | module NormalExit = Hook.Make(struct end)
-                                     ^^^^^^^^^^
- Warning 73 [generative-application-expects-unit]: A generative functor
- should be applied to '()'; using '(struct end)' is deprecated.
- 
- File "src/kernel_services/cmdline_parameters/cmdline.ml", line 620, characters 23-33:
- 620 |   module H = Hook.Make(struct end)
-                              ^^^^^^^^^^
- Warning 73 [generative-application-expects-unit]: A generative functor
- should be applied to '()'; using '(struct end)' is deprecated.
- File "src/libraries/project/project.ml", line 438, characters 31-41:
- 438 | module Before_load = Hook.Make(struct end)
-                                      ^^^^^^^^^^
- Warning 73 [generative-application-expects-unit]: A generative functor
- should be applied to '()'; using '(struct end)' is deprecated.
- 
- File "src/libraries/project/project.ml", line 441, characters 30-40:
- 441 | module After_load = Hook.Make(struct end)
-                                     ^^^^^^^^^^
- Warning 73 [generative-application-expects-unit]: A generative functor
- should be applied to '()'; using '(struct end)' is deprecated.
- 
- File "src/libraries/project/project.ml", line 444, characters 37-47:
- 444 | module After_global_load = Hook.Make(struct end)
-                                            ^^^^^^^^^^
- Warning 73 [generative-application-expects-unit]: A generative functor
- should be applied to '()'; using '(struct end)' is deprecated.
- File "src/libraries/project/project.ml", line 438, characters 31-41:
- 438 | module Before_load = Hook.Make(struct end)
-                                      ^^^^^^^^^^
- Warning 73 [generative-application-expects-unit]: A generative functor
- should be applied to '()'; using '(struct end)' is deprecated.
- 
- File "src/libraries/project/project.ml", line 441, characters 30-40:
- 441 | module After_load = Hook.Make(struct end)
-                                     ^^^^^^^^^^
- Warning 73 [generative-application-expects-unit]: A generative functor
- should be applied to '()'; using '(struct end)' is deprecated.
- 
- File "src/libraries/project/project.ml", line 444, characters 37-47:
- 444 | module After_global_load = Hook.Make(struct end)
-                                            ^^^^^^^^^^
- Warning 73 [generative-application-expects-unit]: A generative functor
- should be applied to '()'; using '(struct end)' is deprecated.
- File "src/kernel_services/ast_queries/logic_env.ml", line 320, characters 20-30:
- 320 |   include Hook.Make(struct end)
-                           ^^^^^^^^^^
- Warning 73 [generative-application-expects-unit]: A generative functor
- should be applied to '()'; using '(struct end)' is deprecated.
- File "src/kernel_services/ast_queries/logic_env.ml", line 320, characters 20-30:
- 320 |   include Hook.Make(struct end)
-                           ^^^^^^^^^^
- Warning 73 [generative-application-expects-unit]: A generative functor
- should be applied to '()'; using '(struct end)' is deprecated.
- File "src/kernel_services/plugin_entry_points/db.ml", line 40, characters 20-30:
- 40 |   include Hook.Make(struct end)
-                          ^^^^^^^^^^
- Warning 73 [generative-application-expects-unit]: A generative functor
- should be applied to '()'; using '(struct end)' is deprecated.
- File "src/kernel_services/plugin_entry_points/db.ml", line 40, characters 20-30:
- 40 |   include Hook.Make(struct end)
-                          ^^^^^^^^^^
- Warning 73 [generative-application-expects-unit]: A generative functor
- should be applied to '()'; using '(struct end)' is deprecated.
- File "src/plugins/gui/gtk_helper.ml", line 290, characters 23-33:
- 290 |   module H = Hook.Make(struct end)
-                              ^^^^^^^^^^
- Warning 73 [generative-application-expects-unit]: A generative functor
- should be applied to '()'; using '(struct end)' is deprecated.
- File "src/plugins/gui/gtk_helper.ml", line 290, characters 23-33:
- 290 |   module H = Hook.Make(struct end)
-                              ^^^^^^^^^^
- Warning 73 [generative-application-expects-unit]: A generative functor
- should be applied to '()'; using '(struct end)' is deprecated.
- File "src/plugins/gui/launcher.ml", line 25, characters 31-41:
- 25 | module Kernel_hook = Hook.Make(struct end)
-                                     ^^^^^^^^^^
- Warning 73 [generative-application-expects-unit]: A generative functor
- should be applied to '()'; using '(struct end)' is deprecated.
- File "src/plugins/gui/launcher.ml", line 25, characters 31-41:
- 25 | module Kernel_hook = Hook.Make(struct end)
-                                     ^^^^^^^^^^
- Warning 73 [generative-application-expects-unit]: A generative functor
- should be applied to '()'; using '(struct end)' is deprecated.
- File "src/plugins/e-acsl/src/libraries/gmp_types.ml", line 79, characters 16-26:
- 79 | module Z = Make(struct end)
-                      ^^^^^^^^^^
- Warning 73 [generative-application-expects-unit]: A generative functor
- should be applied to '()'; using '(struct end)' is deprecated.
- 
- File "src/plugins/e-acsl/src/libraries/gmp_types.ml", line 80, characters 16-26:
- 80 | module Q = Make(struct end)
-                      ^^^^^^^^^^
- Warning 73 [generative-application-expects-unit]: A generative functor
- should be applied to '()'; using '(struct end)' is deprecated.
- File "src/plugins/e-acsl/src/libraries/gmp_types.ml", line 79, characters 16-26:
- 79 | module Z = Make(struct end)
-                      ^^^^^^^^^^
- Warning 73 [generative-application-expects-unit]: A generative functor
- should be applied to '()'; using '(struct end)' is deprecated.
- 
- File "src/plugins/e-acsl/src/libraries/gmp_types.ml", line 80, characters 16-26:
- 80 | module Q = Make(struct end)
-                      ^^^^^^^^^^
- Warning 73 [generative-application-expects-unit]: A generative functor
- should be applied to '()'; using '(struct end)' is deprecated.
- File "src/plugins/wp/wp_eva.disabled.ml", line 24, characters 21-27:
- Error (warning 27 [unused-var-strict]): unused variable kinstr.
- make: *** [Makefile:66: all] Error 1
[ERROR] The installation of frama-c failed at "make PREFIX=/home/opam/.opam/default MANDIR= install".
[frama-c: make uninstall]
+ /usr/bin/make "PREFIX=/home/opam/.opam/default" "-f" "ivette/Makefile.installation" "uninstall" (CWD=/home/opam/.opam/default/.opam-switch/build/frama-c.27.0~beta)
- Removing Ivette
install failed... 

=== STDERR ===

2026-10-08 14:18.33: FAILED: build frama-c.27.0~beta
2026-10-08 14:18.33: Job failed: build failed: frama-c.27.0~beta