Build:
- 0
2026-09-20 12:36.10: New job: build async_ssl.v0.15.0 (7d23addaea73)
2026-09-20 12:36.10: Waiting for resource in pool day11-builds
2026-09-20 12:55.41: Got resource from pool day11-builds
2026-09-20 12:55.41: [profile full] build async_ssl.v0.15.0
2026-09-20 12:55.41: build async_ssl.v0.15.0 (7d23addaea73)
=== DEPENDENCIES (88 transitive) ===
async.v0.15.0 14ef16210e6c
async_kernel.v0.15.0 d3e880d2dbd1
async_rpc_kernel.v0.15.0 bf2598fffdf3
async_unix.v0.15.0 5a18a011485b
base.v0.15.2 117b15b01f56
base-threads.base ddcab511c589
base-unix.base 742554e1dbc2
base_bigstring.v0.15.0 64b22eadca70
base_quickcheck.v0.15.0 7931ed3ae7c2
bin_prot.v0.15.0 10c623b66a42
cmdliner.1.3.0 764ecbb0ef1c
conf-libffi.2.0.0 2de1e6fba1f5
conf-libssl.4 8f666ff3657c
conf-pkg-config.5 5bc8297bba82
core.v0.15.1 658995cd4589
core_kernel.v0.15.0 68b25bffe2b0
core_unix.v0.15.2 27d931954555
csexp.1.5.2 1b121f20c329
ctypes.0.24.0 7cc4b0889f4a
ctypes-foreign.0.24.0 56b94fdeefc0
dune.3.24.2 ad03795b2751
dune-configurator.3.22.2 1e002eca2c96
expect_test_helpers_core.v0.15.0 5e1f82884836
fieldslib.v0.15.0 ac32586bf2b0
int_repr.v0.15.0 d15a56710dcb
integers.0.8.0 7ff71c3ff985
jane-street-headers.v0.15.0 3b1f3a6558da
jst-config.v0.15.1 a76d13a32cc6
num.1.6 7de70da5b4d0
ocaml.4.13.1 2e7ef074d4e9
ocaml-base-compiler.4.13.1 1682d9f229ca
ocaml-compiler-libs.v0.12.4 3558fdc05ba5
ocaml-config.2 92450e079977
ocaml-secondary-compiler.4.14.2 e2a22285b593
ocaml_intrinsics.v0.15.2 c1112d7c0b03
ocamlbuild.0.16.1 70369bfdfc91
ocamlfind.1.9.6 a72cce87301b
ocamlfind-secondary.1.9.6 3308995dd421
parsexp.v0.15.0 ca93d2fb6813
ppx_assert.v0.15.0 7070799d1152
ppx_base.v0.15.0 1e74e89815e5
ppx_bench.v0.15.1 98e69f0a68c1
ppx_bin_prot.v0.15.0 e0f942f53f80
ppx_cold.v0.15.0 66c67e69c51a
ppx_compare.v0.15.0 7a956b5c6a53
ppx_custom_printf.v0.15.0 e2214f91219c
ppx_derivers.1.2.1 83877103011c
ppx_disable_unused_warnings.v0.15.0 742fc4e1907e
ppx_enumerate.v0.15.0 b3eb31e733c4
ppx_expect.v0.15.1 c3464e30e22e
ppx_fields_conv.v0.15.0 82b48cfaf6e6
ppx_fixed_literal.v0.15.0 ff1adb554b4f
ppx_hash.v0.15.0 27593d013df0
ppx_here.v0.15.0 03f9d81c362e
ppx_ignore_instrumentation.v0.15.0 a3aa16341a80
ppx_inline_test.v0.15.1 44249c203a51
ppx_jane.v0.15.0 5e07e6b8522a
ppx_let.v0.15.0 8f1a09933c17
ppx_log.v0.15.0 9f97515fe239
ppx_module_timer.v0.15.0 10553d18a020
ppx_optcomp.v0.15.0 9c49b05bdc2b
ppx_optional.v0.15.0 51d52d2e9a9e
ppx_pipebang.v0.15.0 35e05961a935
ppx_sexp_conv.v0.15.1 e6aa26e2955f
ppx_sexp_message.v0.15.0 539e0e665414
ppx_sexp_value.v0.15.0 92f70e324320
ppx_stable.v0.15.0 ec20920d6429
ppx_string.v0.15.0 203dd502bbe4
ppx_typerep_conv.v0.15.0 3dea9dd5461a
ppx_variants_conv.v0.15.0 eb701c8ca9a5
ppxlib.0.35.0 bda34af24b93
protocol_version_header.v0.15.0 e81d3e11d83d
re.1.14.0 6d286884c10e
sexp_pretty.v0.15.1 2f71170eb98c
sexplib.v0.15.1 e0b39d38cf8e
sexplib0.v0.15.1 487ec61fc104
spawn.v0.17.0 17d011c94957
splittable_random.v0.15.0 1bef07eab6c3
stdio.v0.15.0 36782dbdca35
stdlib-shims.0.3.0 4554b941f15e
textutils.v0.15.0 d9241074db44
textutils_kernel.v0.15.0 3d65d8420aa0
time_now.v0.15.0 04beda3c013f
timezone.v0.15.0 7dd28eeeacda
topkg.1.1.1 de0aae028880
typerep.v0.15.0 7df4d727d4e0
uutf.1.0.4 98baea561245
variantslib.v0.15.0 b8d1063027d6
=== STDOUT ===
Processing: [default: loading data]
[async_ssl.v0.15.0: dl]
[async_ssl.v0.15.0: extract]
-> retrieved async_ssl.v0.15.0 (https://opam.ocaml.org/cache)
[async_ssl: dune build]
+ /home/opam/.opam/default/bin/dune "build" "-p" "async_ssl" "-j" "39" (CWD=/home/opam/.opam/default/.opam-switch/build/async_ssl.v0.15.0)
- (cd _build/default && /home/opam/.opam/default/bin/ocamlc.opt -w -40 -g -bin-annot -I bindings/.async_ssl_bindings.objs/byte -I /home/opam/.opam/default/lib/base -I /home/opam/.opam/default/lib/base/base_internalhash_types -I /home/opam/.opam/default/lib/base/caml -I /home/opam/.opam/default/lib/base/md5 -I /home/opam/.opam/default/lib/base/shadow_stdlib -I /home/opam/.opam/default/lib/base_quickcheck -I /home/opam/.opam/default/lib/base_quickcheck/ppx_quickcheck/runtime -I /home/opam/.opam/default/lib/bin_prot -I /home/opam/.opam/default/lib/bin_prot/shape -I /home/opam/.opam/default/lib/ctypes -I /home/opam/.opam/default/lib/ctypes-foreign -I /home/opam/.opam/default/lib/ctypes/stubs -I /home/opam/.opam/default/lib/fieldslib -I /home/opam/.opam/default/lib/integers -I /home/opam/.opam/default/lib/jane-street-headers -I /home/opam/.opam/default/lib/ocaml/threads -I /home/opam/.opam/default/lib/parsexp -I /home/opam/.opam/default/lib/ppx_assert/runtime-lib -I /home/opam/.opam/default/lib/ppx_bench/runtime-lib -I /home/opam/.opam/default/lib/ppx_compare/runtime-lib -I /home/opam/.opam/default/lib/ppx_enumerate/runtime-lib -I /home/opam/.opam/default/lib/ppx_expect/collector -I /home/opam/.opam/default/lib/ppx_expect/common -I /home/opam/.opam/default/lib/ppx_expect/config -I /home/opam/.opam/default/lib/ppx_expect/config_types -I /home/opam/.opam/default/lib/ppx_hash/runtime-lib -I /home/opam/.opam/default/lib/ppx_here/runtime-lib -I /home/opam/.opam/default/lib/ppx_inline_test/config -I /home/opam/.opam/default/lib/ppx_inline_test/runtime-lib -I /home/opam/.opam/default/lib/ppx_log/types -I /home/opam/.opam/default/lib/ppx_module_timer/runtime -I /home/opam/.opam/default/lib/ppx_sexp_conv/runtime-lib -I /home/opam/.opam/default/lib/sexplib -I /home/opam/.opam/default/lib/sexplib0 -I /home/opam/.opam/default/lib/splittable_random -I /home/opam/.opam/default/lib/stdio -I /home/opam/.opam/default/lib/stdlib-shims -I /home/opam/.opam/default/lib/time_now -I /home/opam/.opam/default/lib/typerep -I /home/opam/.opam/default/lib/variantslib -no-alias-deps -open Async_ssl_bindings -o bindings/.async_ssl_bindings.objs/byte/async_ssl_bindings__Ctypes_foreign_flat.cmo -c -impl bindings/ctypes_foreign_flat.pp.ml)
- File "bindings/ctypes_foreign_flat.ml", line 5, characters 39-68:
- 5 | module Ctypes_foreign_threaded_stubs = Ctypes_foreign_threaded_stubs
- ^^^^^^^^^^^^^^^^^^^^^^^^^^^^^
- Warning 49 [no-cmi-file]: no cmi file was found in path for module Ctypes_foreign_threaded_stubs
- (cd _build/default && /home/opam/.opam/default/bin/ocamlopt.opt -w -40 -g -I bindings/.async_ssl_bindings.objs/byte -I bindings/.async_ssl_bindings.objs/native -I /home/opam/.opam/default/lib/base -I /home/opam/.opam/default/lib/base/base_internalhash_types -I /home/opam/.opam/default/lib/base/caml -I /home/opam/.opam/default/lib/base/md5 -I /home/opam/.opam/default/lib/base/shadow_stdlib -I /home/opam/.opam/default/lib/base_quickcheck -I /home/opam/.opam/default/lib/base_quickcheck/ppx_quickcheck/runtime -I /home/opam/.opam/default/lib/bin_prot -I /home/opam/.opam/default/lib/bin_prot/shape -I /home/opam/.opam/default/lib/ctypes -I /home/opam/.opam/default/lib/ctypes-foreign -I /home/opam/.opam/default/lib/ctypes/stubs -I /home/opam/.opam/default/lib/fieldslib -I /home/opam/.opam/default/lib/integers -I /home/opam/.opam/default/lib/jane-street-headers -I /home/opam/.opam/default/lib/ocaml/threads -I /home/opam/.opam/default/lib/parsexp -I /home/opam/.opam/default/lib/ppx_assert/runtime-lib -I /home/opam/.opam/default/lib/ppx_bench/runtime-lib -I /home/opam/.opam/default/lib/ppx_compare/runtime-lib -I /home/opam/.opam/default/lib/ppx_enumerate/runtime-lib -I /home/opam/.opam/default/lib/ppx_expect/collector -I /home/opam/.opam/default/lib/ppx_expect/common -I /home/opam/.opam/default/lib/ppx_expect/config -I /home/opam/.opam/default/lib/ppx_expect/config_types -I /home/opam/.opam/default/lib/ppx_hash/runtime-lib -I /home/opam/.opam/default/lib/ppx_here/runtime-lib -I /home/opam/.opam/default/lib/ppx_inline_test/config -I /home/opam/.opam/default/lib/ppx_inline_test/runtime-lib -I /home/opam/.opam/default/lib/ppx_log/types -I /home/opam/.opam/default/lib/ppx_module_timer/runtime -I /home/opam/.opam/default/lib/ppx_sexp_conv/runtime-lib -I /home/opam/.opam/default/lib/sexplib -I /home/opam/.opam/default/lib/sexplib0 -I /home/opam/.opam/default/lib/splittable_random -I /home/opam/.opam/default/lib/stdio -I /home/opam/.opam/default/lib/stdlib-shims -I /home/opam/.opam/default/lib/time_now -I /home/opam/.opam/default/lib/typerep -I /home/opam/.opam/default/lib/variantslib -intf-suffix .ml -no-alias-deps -open Async_ssl_bindings -o bindings/.async_ssl_bindings.objs/native/async_ssl_bindings__Ctypes_foreign_flat.cmx -c -impl bindings/ctypes_foreign_flat.pp.ml)
- File "bindings/ctypes_foreign_flat.ml", line 5, characters 39-68:
- 5 | module Ctypes_foreign_threaded_stubs = Ctypes_foreign_threaded_stubs
- ^^^^^^^^^^^^^^^^^^^^^^^^^^^^^
- Warning 49 [no-cmi-file]: no cmi file was found in path for module Ctypes_foreign_threaded_stubs
- File "src/dune", line 16, characters 10-29:
- 16 | (c_names ffi_generated_stubs) (flags :standard -w -9-27-32-34)
- ^^^^^^^^^^^^^^^^^^^
- (cd _build/default/src && /usr/bin/gcc -O2 -fno-strict-aliasing -fwrapv -pthread -fPIC -D_FILE_OFFSET_BITS=64 -O2 -fno-strict-aliasing -fwrapv -pthread -fPIC -w -g -I /home/opam/.opam/default/lib/ocaml -I /home/opam/.opam/default/lib/async -I /home/opam/.opam/default/lib/async/async_command -I /home/opam/.opam/default/lib/async/async_quickcheck -I /home/opam/.opam/default/lib/async/async_rpc -I /home/opam/.opam/default/lib/async_kernel -I /home/opam/.opam/default/lib/async_kernel/config -I /home/opam/.opam/default/lib/async_kernel/persistent_connection_kernel -I /home/opam/.opam/default/lib/async_kernel/read_write_pair -I /home/opam/.opam/default/lib/async_rpc_kernel -I /home/opam/.opam/default/lib/async_unix -I /home/opam/.opam/default/lib/async_unix/thread_pool -I /home/opam/.opam/default/lib/async_unix/thread_safe_ivar -I /home/opam/.opam/default/lib/base -I /home/opam/.opam/default/lib/base/base_internalhash_types -I /home/opam/.opam/default/lib/base/caml -I /home/opam/.opam/default/lib/base/md5 -I /home/opam/.opam/default/lib/base/shadow_stdlib -I /home/opam/.opam/default/lib/base_bigstring -I /home/opam/.opam/default/lib/base_quickcheck -I /home/opam/.opam/default/lib/base_quickcheck/ppx_quickcheck/runtime -I /home/opam/.opam/default/lib/bin_prot -I /home/opam/.opam/default/lib/bin_prot/shape -I /home/opam/.opam/default/lib/core -I /home/opam/.opam/default/lib/core/base_for_tests -I /home/opam/.opam/default/lib/core/validate -I /home/opam/.opam/default/lib/core_kernel/bounded_int_table -I /home/opam/.opam/default/lib/core_kernel/caml_threads -I /home/opam/.opam/default/lib/core_kernel/caml_unix -I /home/opam/.opam/default/lib/core_kernel/flags -I /home/opam/.opam/default/lib/core_kernel/iobuf -I /home/opam/.opam/default/lib/core_kernel/moption -I /home/opam/.opam/default/lib/core_kernel/pairing_heap -I /home/opam/.opam/default/lib/core_kernel/sexp_hidden_in_test -I /home/opam/.opam/default/lib/core_kernel/thread_pool_cpu_affinity -I /home/opam/.opam/default/lib/core_kernel/thread_safe_queue -I /home/opam/.opam/default/lib/core_kernel/timing_wheel -I /home/opam/.opam/default/lib/core_kernel/tuple_pool -I /home/opam/.opam/default/lib/core_kernel/uopt -I /home/opam/.opam/default/lib/core_kernel/uuid -I /home/opam/.opam/default/lib/core_unix -I /home/opam/.opam/default/lib/core_unix/bigstring_unix -I /home/opam/.opam/default/lib/core_unix/core_thread -I /home/opam/.opam/default/lib/core_unix/error_checking_mutex -I /home/opam/.opam/default/lib/core_unix/filename_unix -I /home/opam/.opam/default/lib/core_unix/iobuf_unix -I /home/opam/.opam/default/lib/core_unix/linux_ext -I /home/opam/.opam/default/lib/core_unix/nano_mutex -I /home/opam/.opam/default/lib/core_unix/ocaml_c_utils -I /home/opam/.opam/default/lib/core_unix/signal_unix -I /home/opam/.opam/default/lib/core_unix/squeue -I /home/opam/.opam/default/lib/core_unix/sys_unix -I /home/opam/.opam/default/lib/core_unix/time_ns_unix -I /home/opam/.opam/default/lib/core_unix/time_stamp_counter -I /home/opam/.opam/default/lib/core_unix/time_unix -I /home/opam/.opam/default/lib/core_unix/uuid -I /home/opam/.opam/default/lib/ctypes -I /home/opam/.opam/default/lib/ctypes-foreign -I /home/opam/.opam/default/lib/ctypes/stubs -I /home/opam/.opam/default/lib/fieldslib -I /home/opam/.opam/default/lib/int_repr -I /home/opam/.opam/default/lib/integers -I /home/opam/.opam/default/lib/jane-street-headers -I /home/opam/.opam/default/lib/ocaml/threads -I /home/opam/.opam/default/lib/ocaml_intrinsics -I /home/opam/.opam/default/lib/parsexp -I /home/opam/.opam/default/lib/ppx_assert/runtime-lib -I /home/opam/.opam/default/lib/ppx_bench/runtime-lib -I /home/opam/.opam/default/lib/ppx_compare/runtime-lib -I /home/opam/.opam/default/lib/ppx_enumerate/runtime-lib -I /home/opam/.opam/default/lib/ppx_expect/collector -I /home/opam/.opam/default/lib/ppx_expect/common -I /home/opam/.opam/default/lib/ppx_expect/config -I /home/opam/.opam/default/lib/ppx_expect/config_types -I /home/opam/.opam/default/lib/ppx_hash/runtime-lib -I /home/opam/.opam/default/lib/ppx_here/runtime-lib -I /home/opam/.opam/default/lib/ppx_inline_test/config -I /home/opam/.opam/default/lib/ppx_inline_test/runtime-lib -I /home/opam/.opam/default/lib/ppx_log/types -I /home/opam/.opam/default/lib/ppx_module_timer/runtime -I /home/opam/.opam/default/lib/ppx_sexp_conv/runtime-lib -I /home/opam/.opam/default/lib/protocol_version_header -I /home/opam/.opam/default/lib/sexplib -I /home/opam/.opam/default/lib/sexplib/unix -I /home/opam/.opam/default/lib/sexplib0 -I /home/opam/.opam/default/lib/spawn -I /home/opam/.opam/default/lib/splittable_random -I /home/opam/.opam/default/lib/stdio -I /home/opam/.opam/default/lib/stdlib-shims -I /home/opam/.opam/default/lib/time_now -I /home/opam/.opam/default/lib/timezone -I /home/opam/.opam/default/lib/typerep -I /home/opam/.opam/default/lib/variantslib -I ../bindings -o ffi_generated_stubs.o -c ffi_generated_stubs.c)
- ffi_generated_stubs.c: In function 'async_ssl_stub_14_ENGINE_load_builtin_engines':
- ffi_generated_stubs.c:80:4: error: implicit declaration of function 'ENGINE_load_builtin_engines' [-Wimplicit-function-declaration]
- 80 | ENGINE_load_builtin_engines();
- | ^~~~~~~~~~~~~~~~~~~~~~~~~~~
- ffi_generated_stubs.c: In function 'async_ssl_stub_15_ENGINE_unregister_RAND':
- ffi_generated_stubs.c:85:4: error: implicit declaration of function 'ENGINE_unregister_RAND' [-Wimplicit-function-declaration]
- 85 | ENGINE_unregister_RAND();
- | ^~~~~~~~~~~~~~~~~~~~~~
- ffi_generated_stubs.c: In function 'async_ssl_stub_16_ENGINE_register_all_complete':
- ffi_generated_stubs.c:90:4: error: implicit declaration of function 'ENGINE_register_all_complete' [-Wimplicit-function-declaration]
- 90 | ENGINE_register_all_complete();
- | ^~~~~~~~~~~~~~~~~~~~~~~~~~~~
- ffi_generated_stubs.c: In function 'async_ssl_stub_50_BN_hex2bn':
- ffi_generated_stubs.c:315:25: error: passing argument 1 of 'BN_hex2bn' from incompatible pointer type [-Wincompatible-pointer-types]
- 315 | int x199 = BN_hex2bn(x197, x198);
- | ^~~~
- | |
- | void **
- In file included from /usr/include/openssl/params.h:16,
- from /usr/include/openssl/indicator.h:18,
- from /usr/include/openssl/core_dispatch.h:16,
- from /usr/include/openssl/evp.h:28,
- from /usr/include/openssl/x509.h:31,
- from /usr/include/openssl/ssl.h:34,
- from ffi_generated_stubs.c:2:
- /usr/include/openssl/bn.h:345:24: note: expected 'BIGNUM **' {aka 'struct bignum_st **'} but argument is of type 'void **'
- 345 | int BN_hex2bn(BIGNUM **a, const char *str);
- | ~~~~~~~~~^
- ffi_generated_stubs.c: In function 'async_ssl_stub_72_SSL_set_tmp_dh_callback':
- ffi_generated_stubs.c:467:34: error: passing argument 2 of 'SSL_set_tmp_dh_callback' from incompatible pointer type [-Wincompatible-pointer-types]
- 467 | SSL_set_tmp_dh_callback(x320, x321);
- | ^~~~
- | |
- | void * (*)(void *, _Bool, int)
- /usr/include/openssl/ssl.h:2282:11: note: expected 'DH * (*)(SSL *, int, int)' {aka 'struct dh_st * (*)(struct ssl_st *, int, int)'} but argument is of type 'void * (*)(void *, _Bool, int)'
- 2282 | DH *(*dh)(SSL *ssl, int is_export,
- | ~~~~~~^~~~~~~~~~~~~~~~~~~~~~~~~~~~
- 2283 | int keylength));
- | ~~~~~~~~~~~~~~
[ERROR] The compilation of async_ssl.v0.15.0 failed at "dune build -p async_ssl -j 39".
build failed...
=== STDERR ===
2026-09-20 12:55.56: FAILED: build async_ssl.v0.15.0
2026-09-20 12:55.56: Job failed: build failed: async_ssl.v0.15.0