Build:
  1. 0
2026-09-20 12:36.10: New job: build ocaml-embed-file.v0.15.0 (99675fc6a939)
2026-09-20 12:36.10: Waiting for resource in pool day11-builds
2026-09-20 12:55.41: Got resource from pool day11-builds
2026-09-20 12:55.41: [profile full] build ocaml-embed-file.v0.15.0
2026-09-20 12:55.41: build ocaml-embed-file.v0.15.0 (99675fc6a939)
=== DEPENDENCIES (82 transitive) ===
  async.v0.15.0                                      14ef16210e6c
  async_kernel.v0.15.0                               d3e880d2dbd1
  async_rpc_kernel.v0.15.0                           bf2598fffdf3
  async_unix.v0.15.0                                 5a18a011485b
  base.v0.15.2                                       117b15b01f56
  base-threads.base                                  ddcab511c589
  base-unix.base                                     742554e1dbc2
  base_bigstring.v0.15.0                             64b22eadca70
  base_quickcheck.v0.15.0                            7931ed3ae7c2
  bin_prot.v0.15.0                                   10c623b66a42
  cmdliner.1.3.0                                     764ecbb0ef1c
  core.v0.15.1                                       658995cd4589
  core_kernel.v0.15.0                                68b25bffe2b0
  core_unix.v0.15.2                                  27d931954555
  csexp.1.5.2                                        1b121f20c329
  dune.3.24.2                                        ad03795b2751
  dune-configurator.3.22.2                           1e002eca2c96
  expect_test_helpers_core.v0.15.0                   5e1f82884836
  fieldslib.v0.15.0                                  ac32586bf2b0
  int_repr.v0.15.0                                   d15a56710dcb
  jane-street-headers.v0.15.0                        3b1f3a6558da
  jst-config.v0.15.1                                 a76d13a32cc6
  num.1.6                                            7de70da5b4d0
  ocaml.4.13.1                                       2e7ef074d4e9
  ocaml-base-compiler.4.13.1                         1682d9f229ca
  ocaml-compiler-libs.v0.12.4                        3558fdc05ba5
  ocaml-config.2                                     92450e079977
  ocaml-secondary-compiler.4.14.2                    e2a22285b593
  ocaml_intrinsics.v0.15.2                           c1112d7c0b03
  ocamlbuild.0.16.1                                  70369bfdfc91
  ocamlfind.1.9.6                                    a72cce87301b
  ocamlfind-secondary.1.9.6                          3308995dd421
  parsexp.v0.15.0                                    ca93d2fb6813
  ppx_assert.v0.15.0                                 7070799d1152
  ppx_base.v0.15.0                                   1e74e89815e5
  ppx_bench.v0.15.1                                  98e69f0a68c1
  ppx_bin_prot.v0.15.0                               e0f942f53f80
  ppx_cold.v0.15.0                                   66c67e69c51a
  ppx_compare.v0.15.0                                7a956b5c6a53
  ppx_custom_printf.v0.15.0                          e2214f91219c
  ppx_derivers.1.2.1                                 83877103011c
  ppx_disable_unused_warnings.v0.15.0                742fc4e1907e
  ppx_enumerate.v0.15.0                              b3eb31e733c4
  ppx_expect.v0.15.1                                 c3464e30e22e
  ppx_fields_conv.v0.15.0                            82b48cfaf6e6
  ppx_fixed_literal.v0.15.0                          ff1adb554b4f
  ppx_hash.v0.15.0                                   27593d013df0
  ppx_here.v0.15.0                                   03f9d81c362e
  ppx_ignore_instrumentation.v0.15.0                 a3aa16341a80
  ppx_inline_test.v0.15.1                            44249c203a51
  ppx_jane.v0.15.0                                   5e07e6b8522a
  ppx_let.v0.15.0                                    8f1a09933c17
  ppx_log.v0.15.0                                    9f97515fe239
  ppx_module_timer.v0.15.0                           10553d18a020
  ppx_optcomp.v0.15.0                                9c49b05bdc2b
  ppx_optional.v0.15.0                               51d52d2e9a9e
  ppx_pipebang.v0.15.0                               35e05961a935
  ppx_sexp_conv.v0.15.1                              e6aa26e2955f
  ppx_sexp_message.v0.15.0                           539e0e665414
  ppx_sexp_value.v0.15.0                             92f70e324320
  ppx_stable.v0.15.0                                 ec20920d6429
  ppx_string.v0.15.0                                 203dd502bbe4
  ppx_typerep_conv.v0.15.0                           3dea9dd5461a
  ppx_variants_conv.v0.15.0                          eb701c8ca9a5
  ppxlib.0.35.0                                      bda34af24b93
  protocol_version_header.v0.15.0                    e81d3e11d83d
  re.1.14.0                                          6d286884c10e
  sexp_pretty.v0.15.1                                2f71170eb98c
  sexplib.v0.15.1                                    e0b39d38cf8e
  sexplib0.v0.15.1                                   487ec61fc104
  spawn.v0.17.0                                      17d011c94957
  splittable_random.v0.15.0                          1bef07eab6c3
  stdio.v0.15.0                                      36782dbdca35
  stdlib-shims.0.3.0                                 4554b941f15e
  textutils.v0.15.0                                  d9241074db44
  textutils_kernel.v0.15.0                           3d65d8420aa0
  time_now.v0.15.0                                   04beda3c013f
  timezone.v0.15.0                                   7dd28eeeacda
  topkg.1.1.1                                        de0aae028880
  typerep.v0.15.0                                    7df4d727d4e0
  uutf.1.0.4                                         98baea561245
  variantslib.v0.15.0                                b8d1063027d6
=== STDOUT ===
Processing: [default: loading data]
[ocaml-embed-file.v0.15.0: dl]
[ocaml-embed-file.v0.15.0: extract]
-> retrieved ocaml-embed-file.v0.15.0  (https://opam.ocaml.org/cache)
[ocaml-embed-file: dune build]
+ /home/opam/.opam/default/bin/dune "build" "-p" "ocaml-embed-file" "-j" "39" (CWD=/home/opam/.opam/default/.opam-switch/build/ocaml-embed-file.v0.15.0)
- File "bin/dune", line 1, characters 20-30:
- 1 | (executables (names embed_file) (public_names ocaml-embed-file)
-                         ^^^^^^^^^^
- (cd _build/default && /home/opam/.opam/default/bin/ocamlopt.opt -w -40 -g -o bin/embed_file.exe /home/opam/.opam/default/lib/base/base_internalhash_types/base_internalhash_types.cmxa -I /home/opam/.opam/default/lib/base/base_internalhash_types /home/opam/.opam/default/lib/base/caml/caml.cmxa /home/opam/.opam/default/lib/sexplib0/sexplib0.cmxa /home/opam/.opam/default/lib/base/shadow_stdlib/shadow_stdlib.cmxa /home/opam/.opam/default/lib/base/base.cmxa -I /home/opam/.opam/default/lib/base /home/opam/.opam/default/lib/ppx_sexp_conv/runtime-lib/ppx_sexp_conv_lib.cmxa /home/opam/.opam/default/lib/ppx_compare/runtime-lib/ppx_compare_lib.cmxa /home/opam/.opam/default/lib/ppx_enumerate/runtime-lib/ppx_enumerate_lib.cmxa /home/opam/.opam/default/lib/ppx_hash/runtime-lib/ppx_hash_lib.cmxa /home/opam/.opam/default/lib/ppx_here/runtime-lib/ppx_here_lib.cmxa /home/opam/.opam/default/lib/ppx_assert/runtime-lib/ppx_assert_lib.cmxa /home/opam/.opam/default/lib/ppx_bench/runtime-lib/ppx_bench_lib.cmxa /home/opam/.opam/default/lib/base/md5/md5_lib.cmxa /home/opam/.opam/default/lib/ocaml/unix.cmxa -I /home/opam/.opam/default/lib/ocaml /home/opam/.opam/default/lib/ocaml/bigarray.cmxa -I /home/opam/.opam/default/lib/ocaml /home/opam/.opam/default/lib/fieldslib/fieldslib.cmxa /home/opam/.opam/default/lib/variantslib/variantslib.cmxa /home/opam/.opam/default/lib/bin_prot/shape/bin_shape_lib.cmxa /home/opam/.opam/default/lib/bin_prot/bin_prot.cmxa -I /home/opam/.opam/default/lib/bin_prot /home/opam/.opam/default/lib/ppx_inline_test/config/inline_test_config.cmxa /home/opam/.opam/default/lib/jane-street-headers/jane_street_headers.cmxa /home/opam/.opam/default/lib/time_now/time_now.cmxa -I /home/opam/.opam/default/lib/time_now /home/opam/.opam/default/lib/ppx_inline_test/runtime-lib/ppx_inline_test_lib.cmxa /home/opam/.opam/default/lib/stdio/stdio.cmxa /home/opam/.opam/default/lib/ppx_module_timer/runtime/ppx_module_timer_runtime.cmxa /home/opam/.opam/default/lib/typerep/typerep_lib.cmxa /home/opam/.opam/default/lib/ppx_expect/common/expect_test_common.cmxa /home/opam/.opam/default/lib/ppx_expect/config_types/expect_test_config_types.cmxa /home/opam/.opam/default/lib/ppx_expect/collector/expect_test_collector.cmxa -I /home/opam/.opam/default/lib/ppx_expect/collector /home/opam/.opam/default/lib/ppx_expect/config/expect_test_config.cmxa /home/opam/.opam/default/lib/parsexp/parsexp.cmxa /home/opam/.opam/default/lib/sexplib/sexplib.cmxa /home/opam/.opam/default/lib/ppx_log/types/ppx_log_types.cmxa /home/opam/.opam/default/lib/splittable_random/splittable_random.cmxa /home/opam/.opam/default/lib/base_quickcheck/base_quickcheck.cmxa /home/opam/.opam/default/lib/base_quickcheck/ppx_quickcheck/runtime/ppx_quickcheck_runtime.cmxa /home/opam/.opam/default/lib/int_repr/int_repr.cmxa /home/opam/.opam/default/lib/base_bigstring/base_bigstring.cmxa -I /home/opam/.opam/default/lib/base_bigstring /home/opam/.opam/default/lib/core/base_for_tests/base_for_tests.cmxa /home/opam/.opam/default/lib/core/validate/validate.cmxa /home/opam/.opam/default/lib/core/core.cmxa -I /home/opam/.opam/default/lib/core /home/opam/.opam/default/lib/ocaml/threads/threads.cmxa -I /home/opam/.opam/default/lib/ocaml /home/opam/.opam/default/lib/core_kernel/caml_threads/caml_threads.cmxa /home/opam/.opam/default/lib/core_kernel/caml_unix/caml_unix.cmxa /home/opam/.opam/default/lib/core_unix/signal_unix/signal_unix.cmxa -I /home/opam/.opam/default/lib/core_unix/signal_unix /home/opam/.opam/default/lib/core_unix/core_thread/core_thread.cmxa -I /home/opam/.opam/default/lib/core_unix/core_thread /home/opam/.opam/default/lib/core_unix/sys_unix/sys_unix.cmxa -I /home/opam/.opam/default/lib/core_unix/sys_unix /home/opam/.opam/default/lib/core_unix/error_checking_mutex/error_checking_mutex.cmxa -I /home/opam/.opam/default/lib/core_unix/error_checking_mutex /home/opam/.opam/default/lib/core_kernel/flags/flags.cmxa /home/opam/.opam/default/lib/sexplib/unix/sexplib_unix.cmxa /home/opam/.opam/default/lib/spawn/spawn.cmxa -I /home/opam/.opam/default/lib/spawn /home/opam/.opam/default/lib/core_unix/core_unix.cmxa -I /home/opam/.opam/default/lib/core_unix /home/opam/.opam/default/lib/timezone/timezone.cmxa /home/opam/.opam/default/lib/core_unix/time_unix/time_unix.cmxa /home/opam/.opam/default/lib/core_kernel/version_util/version_util.cmxa -I /home/opam/.opam/default/lib/core_kernel/version_util /home/opam/.opam/default/lib/core_unix/command_unix/command_unix.cmxa /home/opam/.opam/default/lib/core_kernel/thread_pool_cpu_affinity/thread_pool_cpu_affinity.cmxa /home/opam/.opam/default/lib/core_kernel/tuple_pool/tuple_pool.cmxa /home/opam/.opam/default/lib/core_kernel/timing_wheel/timing_wheel.cmxa /home/opam/.opam/default/lib/async_kernel/config/async_kernel_config.cmxa /home/opam/.opam/default/lib/core_kernel/moption/moption.cmxa /home/opam/.opam/default/lib/core_kernel/pairing_heap/pairing_heap.cmxa /home/opam/.opam/default/lib/core_kernel/sexp_hidden_in_test/sexp_hidden_in_test.cmxa /home/opam/.opam/default/lib/core_kernel/uopt/uopt.cmxa /home/opam/.opam/default/lib/core_kernel/thread_safe_queue/thread_safe_queue.cmxa /home/opam/.opam/default/lib/async_kernel/async_kernel.cmxa /home/opam/.opam/default/lib/core_unix/ocaml_c_utils/ocaml_c_utils.cmxa -I /home/opam/.opam/default/lib/core_unix/ocaml_c_utils /home/opam/.opam/default/lib/core_unix/bigstring_unix/bigstring_unix.cmxa -I /home/opam/.opam/default/lib/core_unix/bigstring_unix /home/opam/.opam/default/lib/core_kernel/bounded_int_table/bounded_int_table.cmxa /home/opam/.opam/default/lib/core_unix/filename_unix/filename_unix.cmxa -I /home/opam/.opam/default/lib/core_unix/filename_unix /home/opam/.opam/default/lib/core_kernel/iobuf/iobuf.cmxa /home/opam/.opam/default/lib/core_unix/iobuf_unix/iobuf_unix.cmxa -I /home/opam/.opam/default/lib/core_unix/iobuf_unix /home/opam/.opam/default/lib/core_unix/nano_mutex/nano_mutex.cmxa /home/opam/.opam/default/lib/async_kernel/read_write_pair/read_write_pair.cmxa /home/opam/.opam/default/lib/core_unix/squeue/squeue.cmxa /home/opam/.opam/default/lib/core_unix/time_ns_unix/time_ns_unix.cmxa /home/opam/.opam/default/lib/core_unix/linux_ext/linux_ext.cmxa -I /home/opam/.opam/default/lib/core_unix/linux_ext /home/opam/.opam/default/lib/async_unix/thread_safe_ivar/thread_safe_ivar.cmxa /home/opam/.opam/default/lib/async_unix/thread_pool/thread_pool.cmxa /home/opam/.opam/default/lib/ocaml_intrinsics/ocaml_intrinsics.cmxa -I /home/opam/.opam/default/lib/ocaml_intrinsics /home/opam/.opam/default/lib/core_unix/time_stamp_counter/time_stamp_counter.cmxa -I /home/opam/.opam/default/lib/core_unix/time_stamp_counter /home/opam/.opam/default/lib/core_kernel/uuid/uuid.cmxa /home/opam/.opam/default/lib/core_unix/uuid/uuid_unix.cmxa /home/opam/.opam/default/lib/async_unix/async_unix.cmxa -I /home/opam/.opam/default/lib/async_unix /home/opam/.opam/default/lib/async/async_command/async_command.cmxa /home/opam/.opam/default/lib/async/async_quickcheck/async_quickcheck.cmxa /home/opam/.opam/default/lib/async_kernel/persistent_connection_kernel/persistent_connection_kernel.cmxa /home/opam/.opam/default/lib/protocol_version_header/protocol_version_header.cmxa /home/opam/.opam/default/lib/async_rpc_kernel/async_rpc_kernel.cmxa /home/opam/.opam/default/lib/async/async_rpc/async_rpc.cmxa -I /home/opam/.opam/default/lib/async/async_rpc /home/opam/.opam/default/lib/async/async.cmxa src/embed_file_lib.cmxa bin/.embed_file.eobjs/native/embed_file.cmx)
- /usr/bin/ld: /home/opam/.opam/default/lib/core_unix/linux_ext/linux_ext.a(linux_ext.o): in function `camlLinux_ext__sched_setaffinity_this_thread_92001':
- /home/opam/.opam/default/.opam-switch/build/core_unix.v0.15.2/_build/default/linux_ext/src/linux_ext.ml:830:(.text+0x5260): undefined reference to `core_unix_gettid'
- /usr/bin/ld: /home/opam/.opam/default/lib/core_unix/linux_ext/linux_ext.a(linux_ext.o): in function `camlLinux_ext__1':
- :(.data+0x4300): undefined reference to `core_unix_gettid'
- collect2: error: ld returned 1 exit status
- File "caml_startup", line 1:
- Error: Error during linking (exit code 1)
[ERROR] The compilation of ocaml-embed-file.v0.15.0 failed at "dune build -p ocaml-embed-file -j 39".
build failed... 

=== STDERR ===

2026-09-20 12:55.56: FAILED: build ocaml-embed-file.v0.15.0
2026-09-20 12:55.56: Job failed: build failed: ocaml-embed-file.v0.15.0