Build:
  1. 0
2026-09-20 12:02.19: New job: build async_ssl.v0.15.0 (79176cb0bef2)
2026-09-20 12:02.19: Waiting for resource in pool day11-builds
2026-09-20 12:30.15: Got resource from pool day11-builds
2026-09-20 12:30.15: [profile full] build async_ssl.v0.15.0
2026-09-20 12:30.15: build async_ssl.v0.15.0 (79176cb0bef2)
=== DEPENDENCIES (85 transitive) ===
  async.v0.15.0                                      a0827deed29a
  async_kernel.v0.15.0                               244b58d06506
  async_rpc_kernel.v0.15.0                           1a842df0fdd1
  async_unix.v0.15.0                                 6bbd4cd9e385
  base.v0.15.2                                       8ac380729cb2
  base-threads.base                                  ddcab511c589
  base-unix.base                                     742554e1dbc2
  base_bigstring.v0.15.0                             e0fb17320ab4
  base_quickcheck.v0.15.0                            4fcef2d45ed8
  bin_prot.v0.15.0                                   d658073c7f3e
  conf-libffi.2.0.0                                  2de1e6fba1f5
  conf-libssl.4                                      8f666ff3657c
  conf-pkg-config.5                                  5bc8297bba82
  core.v0.15.1                                       3b1425cb4468
  core_kernel.v0.15.0                                c6e40626b3b0
  core_unix.v0.15.2                                  eb16b9cba16a
  csexp.1.5.2                                        2634d02feb2e
  ctypes.0.24.0                                      ae7b97b47390
  ctypes-foreign.0.24.0                              3b2fd0c41d30
  dune.3.24.2                                        5923405810fc
  dune-configurator.3.24.2                           791f1620030a
  expect_test_helpers_core.v0.15.0                   6b3319927c0f
  fieldslib.v0.15.0                                  e42d03ee663c
  int_repr.v0.15.0                                   b832cb1b74f5
  integers.0.8.0                                     b8a736f817f1
  jane-street-headers.v0.15.0                        141909fa1e61
  jst-config.v0.15.1                                 30cbd4b1e8d0
  num.1.6                                            8ee33ff953b1
  ocaml.5.0.0                                        8d11afc53104
  ocaml-base-compiler.5.0.0                          bae3367493d6
  ocaml-compiler-libs.v0.12.4                        724ad2eaed88
  ocaml-config.3                                     773982463adc
  ocaml_intrinsics.v0.15.2                           eb663b2f3742
  ocamlbuild.0.16.1                                  11c9e615d587
  ocamlfind.1.9.8                                    36f8148f945d
  parsexp.v0.15.0                                    41b490663f08
  ppx_assert.v0.15.0                                 e1466bd6cbcd
  ppx_base.v0.15.0                                   54aba138084a
  ppx_bench.v0.15.1                                  b0d80c768b70
  ppx_bin_prot.v0.15.0                               4a403d961a2f
  ppx_cold.v0.15.0                                   1c7099636edf
  ppx_compare.v0.15.0                                151895bcf17d
  ppx_custom_printf.v0.15.0                          86e0984c6c40
  ppx_derivers.1.2.1                                 5e8eb0f244d4
  ppx_disable_unused_warnings.v0.15.0                750ad89d7f0a
  ppx_enumerate.v0.15.0                              1a6127583f0f
  ppx_expect.v0.15.1                                 ee590df84127
  ppx_fields_conv.v0.15.0                            eb4fcf8cccbc
  ppx_fixed_literal.v0.15.0                          3b9a90c07cb1
  ppx_hash.v0.15.0                                   a025f5be245b
  ppx_here.v0.15.0                                   e5446176f8ce
  ppx_ignore_instrumentation.v0.15.0                 eb4b5f1cbec8
  ppx_inline_test.v0.15.1                            dc737fc18c87
  ppx_jane.v0.15.0                                   16ad93869e54
  ppx_let.v0.15.0                                    7aae7f345b14
  ppx_log.v0.15.0                                    5f32449d4f1a
  ppx_module_timer.v0.15.0                           5edd9410a529
  ppx_optcomp.v0.15.0                                cd0b7132396b
  ppx_optional.v0.15.0                               bf4695e5e0fc
  ppx_pipebang.v0.15.0                               559897541dc9
  ppx_sexp_conv.v0.15.1                              e61f8df9c3e1
  ppx_sexp_message.v0.15.0                           802b68533107
  ppx_sexp_value.v0.15.0                             e477d6f9ee75
  ppx_stable.v0.15.0                                 e5a1192354df
  ppx_string.v0.15.0                                 07c338328da4
  ppx_typerep_conv.v0.15.0                           a2cb5aadf0a6
  ppx_variants_conv.v0.15.0                          ceb44d7a243b
  ppxlib.0.35.0                                      0ee913cb7116
  protocol_version_header.v0.15.0                    4ae85be741da
  re.1.14.0                                          bee1f10f75f8
  sexp_pretty.v0.15.1                                2ceca3428391
  sexplib.v0.15.1                                    a49716f7a6ac
  sexplib0.v0.15.1                                   f151740790b8
  spawn.v0.17.0                                      214926de4a7c
  splittable_random.v0.15.0                          36a18f732e4f
  stdio.v0.15.0                                      c055ef851a24
  stdlib-shims.0.3.0                                 f9bc7e1961de
  textutils.v0.15.0                                  d2e950aa465f
  textutils_kernel.v0.15.0                           15f8c54b5f04
  time_now.v0.15.0                                   924525f6b80e
  timezone.v0.15.0                                   b10267b1cacb
  topkg.1.1.1                                        115afb6fe807
  typerep.v0.15.0                                    9b2e30e3c4c4
  uutf.1.0.4                                         73f3abcb2be3
  variantslib.v0.15.0                                d7c7ba835c5e
=== STDOUT ===
Processing: [default: loading data]
[async_ssl.v0.15.0: dl]
[async_ssl.v0.15.0: extract]
-> retrieved async_ssl.v0.15.0  (https://opam.ocaml.org/cache)
[async_ssl: dune build]
+ /home/opam/.opam/default/bin/dune "build" "-p" "async_ssl" "-j" "39" (CWD=/home/opam/.opam/default/.opam-switch/build/async_ssl.v0.15.0)
- (cd _build/default && /home/opam/.opam/default/bin/ocamlc.opt -w -40 -g -bin-annot -I bindings/.async_ssl_bindings.objs/byte -I /home/opam/.opam/default/lib/base -I /home/opam/.opam/default/lib/base/base_internalhash_types -I /home/opam/.opam/default/lib/base/caml -I /home/opam/.opam/default/lib/base/md5 -I /home/opam/.opam/default/lib/base/shadow_stdlib -I /home/opam/.opam/default/lib/base_quickcheck -I /home/opam/.opam/default/lib/base_quickcheck/ppx_quickcheck/runtime -I /home/opam/.opam/default/lib/bin_prot -I /home/opam/.opam/default/lib/bin_prot/shape -I /home/opam/.opam/default/lib/ctypes -I /home/opam/.opam/default/lib/ctypes-foreign -I /home/opam/.opam/default/lib/ctypes/stubs -I /home/opam/.opam/default/lib/fieldslib -I /home/opam/.opam/default/lib/integers -I /home/opam/.opam/default/lib/jane-street-headers -I /home/opam/.opam/default/lib/ocaml/str -I /home/opam/.opam/default/lib/ocaml/threads -I /home/opam/.opam/default/lib/ocaml/unix -I /home/opam/.opam/default/lib/parsexp -I /home/opam/.opam/default/lib/ppx_assert/runtime-lib -I /home/opam/.opam/default/lib/ppx_bench/runtime-lib -I /home/opam/.opam/default/lib/ppx_compare/runtime-lib -I /home/opam/.opam/default/lib/ppx_enumerate/runtime-lib -I /home/opam/.opam/default/lib/ppx_expect/collector -I /home/opam/.opam/default/lib/ppx_expect/common -I /home/opam/.opam/default/lib/ppx_expect/config -I /home/opam/.opam/default/lib/ppx_expect/config_types -I /home/opam/.opam/default/lib/ppx_hash/runtime-lib -I /home/opam/.opam/default/lib/ppx_here/runtime-lib -I /home/opam/.opam/default/lib/ppx_inline_test/config -I /home/opam/.opam/default/lib/ppx_inline_test/runtime-lib -I /home/opam/.opam/default/lib/ppx_log/types -I /home/opam/.opam/default/lib/ppx_module_timer/runtime -I /home/opam/.opam/default/lib/ppx_sexp_conv/runtime-lib -I /home/opam/.opam/default/lib/sexplib -I /home/opam/.opam/default/lib/sexplib0 -I /home/opam/.opam/default/lib/splittable_random -I /home/opam/.opam/default/lib/stdio -I /home/opam/.opam/default/lib/stdlib-shims -I /home/opam/.opam/default/lib/time_now -I /home/opam/.opam/default/lib/typerep -I /home/opam/.opam/default/lib/variantslib -no-alias-deps -open Async_ssl_bindings -o bindings/.async_ssl_bindings.objs/byte/async_ssl_bindings__Ctypes_foreign_flat.cmo -c -impl bindings/ctypes_foreign_flat.pp.ml)
- File "bindings/ctypes_foreign_flat.ml", line 5, characters 39-68:
- 5 | module Ctypes_foreign_threaded_stubs = Ctypes_foreign_threaded_stubs
-                                            ^^^^^^^^^^^^^^^^^^^^^^^^^^^^^
- Warning 49 [no-cmi-file]: no cmi file was found in path for module Ctypes_foreign_threaded_stubs
- (cd _build/default && /home/opam/.opam/default/bin/ocamlopt.opt -w -40 -g -I bindings/.async_ssl_bindings.objs/byte -I bindings/.async_ssl_bindings.objs/native -I /home/opam/.opam/default/lib/base -I /home/opam/.opam/default/lib/base/base_internalhash_types -I /home/opam/.opam/default/lib/base/caml -I /home/opam/.opam/default/lib/base/md5 -I /home/opam/.opam/default/lib/base/shadow_stdlib -I /home/opam/.opam/default/lib/base_quickcheck -I /home/opam/.opam/default/lib/base_quickcheck/ppx_quickcheck/runtime -I /home/opam/.opam/default/lib/bin_prot -I /home/opam/.opam/default/lib/bin_prot/shape -I /home/opam/.opam/default/lib/ctypes -I /home/opam/.opam/default/lib/ctypes-foreign -I /home/opam/.opam/default/lib/ctypes/stubs -I /home/opam/.opam/default/lib/fieldslib -I /home/opam/.opam/default/lib/integers -I /home/opam/.opam/default/lib/jane-street-headers -I /home/opam/.opam/default/lib/ocaml/str -I /home/opam/.opam/default/lib/ocaml/threads -I /home/opam/.opam/default/lib/ocaml/unix -I /home/opam/.opam/default/lib/parsexp -I /home/opam/.opam/default/lib/ppx_assert/runtime-lib -I /home/opam/.opam/default/lib/ppx_bench/runtime-lib -I /home/opam/.opam/default/lib/ppx_compare/runtime-lib -I /home/opam/.opam/default/lib/ppx_enumerate/runtime-lib -I /home/opam/.opam/default/lib/ppx_expect/collector -I /home/opam/.opam/default/lib/ppx_expect/common -I /home/opam/.opam/default/lib/ppx_expect/config -I /home/opam/.opam/default/lib/ppx_expect/config_types -I /home/opam/.opam/default/lib/ppx_hash/runtime-lib -I /home/opam/.opam/default/lib/ppx_here/runtime-lib -I /home/opam/.opam/default/lib/ppx_inline_test/config -I /home/opam/.opam/default/lib/ppx_inline_test/runtime-lib -I /home/opam/.opam/default/lib/ppx_log/types -I /home/opam/.opam/default/lib/ppx_module_timer/runtime -I /home/opam/.opam/default/lib/ppx_sexp_conv/runtime-lib -I /home/opam/.opam/default/lib/sexplib -I /home/opam/.opam/default/lib/sexplib0 -I /home/opam/.opam/default/lib/splittable_random -I /home/opam/.opam/default/lib/stdio -I /home/opam/.opam/default/lib/stdlib-shims -I /home/opam/.opam/default/lib/time_now -I /home/opam/.opam/default/lib/typerep -I /home/opam/.opam/default/lib/variantslib -cmi-file bindings/.async_ssl_bindings.objs/byte/async_ssl_bindings__Ctypes_foreign_flat.cmi -no-alias-deps -open Async_ssl_bindings -o bindings/.async_ssl_bindings.objs/native/async_ssl_bindings__Ctypes_foreign_flat.cmx -c -impl bindings/ctypes_foreign_flat.pp.ml)
- File "bindings/ctypes_foreign_flat.ml", line 5, characters 39-68:
- 5 | module Ctypes_foreign_threaded_stubs = Ctypes_foreign_threaded_stubs
-                                            ^^^^^^^^^^^^^^^^^^^^^^^^^^^^^
- Warning 49 [no-cmi-file]: no cmi file was found in path for module Ctypes_foreign_threaded_stubs
- File "src/dune", line 16, characters 10-29:
- 16 |  (c_names ffi_generated_stubs) (flags :standard -w -9-27-32-34)
-                ^^^^^^^^^^^^^^^^^^^
- (cd _build/default/src && /usr/bin/gcc -O2 -fno-strict-aliasing -fwrapv -pthread -fPIC -D_FILE_OFFSET_BITS=64 -O2 -fno-strict-aliasing -fwrapv -pthread -fPIC -w -g -I /home/opam/.opam/default/lib/ocaml -I /home/opam/.opam/default/lib/async -I /home/opam/.opam/default/lib/async/async_command -I /home/opam/.opam/default/lib/async/async_quickcheck -I /home/opam/.opam/default/lib/async/async_rpc -I /home/opam/.opam/default/lib/async_kernel -I /home/opam/.opam/default/lib/async_kernel/config -I /home/opam/.opam/default/lib/async_kernel/persistent_connection_kernel -I /home/opam/.opam/default/lib/async_kernel/read_write_pair -I /home/opam/.opam/default/lib/async_rpc_kernel -I /home/opam/.opam/default/lib/async_unix -I /home/opam/.opam/default/lib/async_unix/thread_pool -I /home/opam/.opam/default/lib/async_unix/thread_safe_ivar -I /home/opam/.opam/default/lib/base -I /home/opam/.opam/default/lib/base/base_internalhash_types -I /home/opam/.opam/default/lib/base/caml -I /home/opam/.opam/default/lib/base/md5 -I /home/opam/.opam/default/lib/base/shadow_stdlib -I /home/opam/.opam/default/lib/base_bigstring -I /home/opam/.opam/default/lib/base_quickcheck -I /home/opam/.opam/default/lib/base_quickcheck/ppx_quickcheck/runtime -I /home/opam/.opam/default/lib/bin_prot -I /home/opam/.opam/default/lib/bin_prot/shape -I /home/opam/.opam/default/lib/core -I /home/opam/.opam/default/lib/core/base_for_tests -I /home/opam/.opam/default/lib/core/validate -I /home/opam/.opam/default/lib/core_kernel/bounded_int_table -I /home/opam/.opam/default/lib/core_kernel/caml_threads -I /home/opam/.opam/default/lib/core_kernel/caml_unix -I /home/opam/.opam/default/lib/core_kernel/flags -I /home/opam/.opam/default/lib/core_kernel/iobuf -I /home/opam/.opam/default/lib/core_kernel/moption -I /home/opam/.opam/default/lib/core_kernel/pairing_heap -I /home/opam/.opam/default/lib/core_kernel/sexp_hidden_in_test -I /home/opam/.opam/default/lib/core_kernel/thread_pool_cpu_affinity -I /home/opam/.opam/default/lib/core_kernel/thread_safe_queue -I /home/opam/.opam/default/lib/core_kernel/timing_wheel -I /home/opam/.opam/default/lib/core_kernel/tuple_pool -I /home/opam/.opam/default/lib/core_kernel/uopt -I /home/opam/.opam/default/lib/core_kernel/uuid -I /home/opam/.opam/default/lib/core_unix -I /home/opam/.opam/default/lib/core_unix/bigstring_unix -I /home/opam/.opam/default/lib/core_unix/core_thread -I /home/opam/.opam/default/lib/core_unix/error_checking_mutex -I /home/opam/.opam/default/lib/core_unix/filename_unix -I /home/opam/.opam/default/lib/core_unix/iobuf_unix -I /home/opam/.opam/default/lib/core_unix/linux_ext -I /home/opam/.opam/default/lib/core_unix/nano_mutex -I /home/opam/.opam/default/lib/core_unix/ocaml_c_utils -I /home/opam/.opam/default/lib/core_unix/signal_unix -I /home/opam/.opam/default/lib/core_unix/squeue -I /home/opam/.opam/default/lib/core_unix/sys_unix -I /home/opam/.opam/default/lib/core_unix/time_ns_unix -I /home/opam/.opam/default/lib/core_unix/time_stamp_counter -I /home/opam/.opam/default/lib/core_unix/time_unix -I /home/opam/.opam/default/lib/core_unix/uuid -I /home/opam/.opam/default/lib/ctypes -I /home/opam/.opam/default/lib/ctypes-foreign -I /home/opam/.opam/default/lib/ctypes/stubs -I /home/opam/.opam/default/lib/fieldslib -I /home/opam/.opam/default/lib/int_repr -I /home/opam/.opam/default/lib/integers -I /home/opam/.opam/default/lib/jane-street-headers -I /home/opam/.opam/default/lib/ocaml/str -I /home/opam/.opam/default/lib/ocaml/threads -I /home/opam/.opam/default/lib/ocaml/unix -I /home/opam/.opam/default/lib/ocaml_intrinsics -I /home/opam/.opam/default/lib/parsexp -I /home/opam/.opam/default/lib/ppx_assert/runtime-lib -I /home/opam/.opam/default/lib/ppx_bench/runtime-lib -I /home/opam/.opam/default/lib/ppx_compare/runtime-lib -I /home/opam/.opam/default/lib/ppx_enumerate/runtime-lib -I /home/opam/.opam/default/lib/ppx_expect/collector -I /home/opam/.opam/default/lib/ppx_expect/common -I /home/opam/.opam/default/lib/ppx_expect/config -I /home/opam/.opam/default/lib/ppx_expect/config_types -I /home/opam/.opam/default/lib/ppx_hash/runtime-lib -I /home/opam/.opam/default/lib/ppx_here/runtime-lib -I /home/opam/.opam/default/lib/ppx_inline_test/config -I /home/opam/.opam/default/lib/ppx_inline_test/runtime-lib -I /home/opam/.opam/default/lib/ppx_log/types -I /home/opam/.opam/default/lib/ppx_module_timer/runtime -I /home/opam/.opam/default/lib/ppx_sexp_conv/runtime-lib -I /home/opam/.opam/default/lib/protocol_version_header -I /home/opam/.opam/default/lib/sexplib -I /home/opam/.opam/default/lib/sexplib/unix -I /home/opam/.opam/default/lib/sexplib0 -I /home/opam/.opam/default/lib/spawn -I /home/opam/.opam/default/lib/splittable_random -I /home/opam/.opam/default/lib/stdio -I /home/opam/.opam/default/lib/stdlib-shims -I /home/opam/.opam/default/lib/time_now -I /home/opam/.opam/default/lib/timezone -I /home/opam/.opam/default/lib/typerep -I /home/opam/.opam/default/lib/variantslib -I ../bindings -o ffi_generated_stubs.o -c ffi_generated_stubs.c)
- ffi_generated_stubs.c: In function 'async_ssl_stub_14_ENGINE_load_builtin_engines':
- ffi_generated_stubs.c:80:4: error: implicit declaration of function 'ENGINE_load_builtin_engines' [-Wimplicit-function-declaration]
-    80 |    ENGINE_load_builtin_engines();
-       |    ^~~~~~~~~~~~~~~~~~~~~~~~~~~
- ffi_generated_stubs.c: In function 'async_ssl_stub_15_ENGINE_unregister_RAND':
- ffi_generated_stubs.c:85:4: error: implicit declaration of function 'ENGINE_unregister_RAND' [-Wimplicit-function-declaration]
-    85 |    ENGINE_unregister_RAND();
-       |    ^~~~~~~~~~~~~~~~~~~~~~
- ffi_generated_stubs.c: In function 'async_ssl_stub_16_ENGINE_register_all_complete':
- ffi_generated_stubs.c:90:4: error: implicit declaration of function 'ENGINE_register_all_complete' [-Wimplicit-function-declaration]
-    90 |    ENGINE_register_all_complete();
-       |    ^~~~~~~~~~~~~~~~~~~~~~~~~~~~
- ffi_generated_stubs.c: In function 'async_ssl_stub_50_BN_hex2bn':
- ffi_generated_stubs.c:315:25: error: passing argument 1 of 'BN_hex2bn' from incompatible pointer type [-Wincompatible-pointer-types]
-   315 |    int x199 = BN_hex2bn(x197, x198);
-       |                         ^~~~
-       |                         |
-       |                         void **
- In file included from /usr/include/openssl/params.h:16,
-                  from /usr/include/openssl/indicator.h:18,
-                  from /usr/include/openssl/core_dispatch.h:16,
-                  from /usr/include/openssl/evp.h:28,
-                  from /usr/include/openssl/x509.h:31,
-                  from /usr/include/openssl/ssl.h:34,
-                  from ffi_generated_stubs.c:2:
- /usr/include/openssl/bn.h:345:24: note: expected 'BIGNUM **' {aka 'struct bignum_st **'} but argument is of type 'void **'
-   345 | int BN_hex2bn(BIGNUM **a, const char *str);
-       |               ~~~~~~~~~^
- ffi_generated_stubs.c: In function 'async_ssl_stub_72_SSL_set_tmp_dh_callback':
- ffi_generated_stubs.c:467:34: error: passing argument 2 of 'SSL_set_tmp_dh_callback' from incompatible pointer type [-Wincompatible-pointer-types]
-   467 |    SSL_set_tmp_dh_callback(x320, x321);
-       |                                  ^~~~
-       |                                  |
-       |                                  void * (*)(void *, _Bool,  int)
- /usr/include/openssl/ssl.h:2282:11: note: expected 'DH * (*)(SSL *, int,  int)' {aka 'struct dh_st * (*)(struct ssl_st *, int,  int)'} but argument is of type 'void * (*)(void *, _Bool,  int)'
-  2282 |     DH *(*dh)(SSL *ssl, int is_export,
-       |     ~~~~~~^~~~~~~~~~~~~~~~~~~~~~~~~~~~
-  2283 |         int keylength));
-       |         ~~~~~~~~~~~~~~
[ERROR] The compilation of async_ssl.v0.15.0 failed at "dune build -p async_ssl -j 39".
build failed... 

=== STDERR ===

2026-09-20 12:30.53: FAILED: build async_ssl.v0.15.0
2026-09-20 12:30.53: Job failed: build failed: async_ssl.v0.15.0