Build:
- 0
2026-09-20 11:32.58: New job: build async_ssl.v0.14.0 (9f6fb7666330)
2026-09-20 11:32.58: Waiting for resource in pool day11-builds
2026-09-20 12:03.37: Got resource from pool day11-builds
2026-09-20 12:03.37: [profile full] build async_ssl.v0.14.0
2026-09-20 12:03.37: build async_ssl.v0.14.0 (9f6fb7666330)
=== DEPENDENCIES (75 transitive) ===
async.v0.14.0 e013bb1ccaaf
async_kernel.v0.14.0 fa5d902a7847
async_rpc_kernel.v0.14.0 97ebc886cc42
async_unix.v0.14.0 760652f9a960
base.v0.14.4 959ca45bf5a4
base-threads.base ddcab511c589
base-unix.base 742554e1dbc2
base_bigstring.v0.14.0 aa71c133829a
base_quickcheck.v0.14.1 cf23998ef597
bin_prot.v0.14.1 0044863b66d3
conf-libffi.2.0.0 2de1e6fba1f5
conf-libssl.4 8f666ff3657c
conf-pkg-config.5 5bc8297bba82
core.v0.14.1 add6a0897e91
core_kernel.v0.14.2 5013dfff4545
csexp.1.5.2 f3f13927fb9a
ctypes.0.17.1 71b2c9a36f39
ctypes-foreign.0.18.0 4ff1d07bf0ba
dune.3.24.2 ea2bcb45ca29
dune-configurator.3.24.2 01cbc2b77bf8
fieldslib.v0.14.0 b798f0830a6d
integers.0.8.0 9634da00660c
jane-street-headers.v0.14.0 21d260d06631
jst-config.v0.14.1 d7fa9e468574
num.1.6 9b8d17e98111
ocaml.4.14.4 0eceb429ac11
ocaml-base-compiler.4.14.4 4a21df12bcb6
ocaml-compiler-libs.v0.12.4 35eb4dc2f91b
ocaml-config.2 58cec4e89336
ocamlfind.1.9.8 7bca84f6ccc0
octavius.1.2.2 97d9290a1d0b
parsexp.v0.14.2 f7e11232e6cb
ppx_assert.v0.14.0 2d016e56dc9e
ppx_base.v0.14.0 622550748c4b
ppx_bench.v0.14.1 9f56f912dd10
ppx_bin_prot.v0.14.0 a2bdd9035b78
ppx_cold.v0.14.0 7aea44ff6364
ppx_compare.v0.14.0 f9a2a6a38e5e
ppx_custom_printf.v0.14.1 f9ee6a3d00b8
ppx_derivers.1.2.1 c7bcacc2160f
ppx_enumerate.v0.14.0 f3103f65bcb1
ppx_expect.v0.14.2 315b49b6e0e9
ppx_fields_conv.v0.14.2 3d97d765a1d3
ppx_fixed_literal.v0.14.0 5936d91ffeb6
ppx_hash.v0.14.0 63a84e6150f4
ppx_here.v0.14.0 811ef8f15572
ppx_inline_test.v0.14.1 6f57747b3d36
ppx_jane.v0.14.0 4f2dfa3d8650
ppx_js_style.v0.14.1 34924aaacd24
ppx_let.v0.14.0 a42afd2a7a10
ppx_module_timer.v0.14.0 1584b27c0be0
ppx_optcomp.v0.14.3 611fd476bf8f
ppx_optional.v0.14.0 0b8b54e9c33e
ppx_pipebang.v0.14.0 abf107d01709
ppx_sexp_conv.v0.14.3 2c47cc8c6e7f
ppx_sexp_message.v0.14.1 75b083c76921
ppx_sexp_value.v0.14.0 515dbc3637df
ppx_stable.v0.14.1 6547282006ff
ppx_string.v0.14.1 9226145e5687
ppx_typerep_conv.v0.14.2 00d274eb4b95
ppx_variants_conv.v0.14.2 ba6a3013e14e
ppxlib.0.25.1 f2e112213d72
protocol_version_header.v0.14.0 ec5e6f3e46ad
re.1.14.0 c1e5a6d52961
sexplib.v0.14.0 9195ff3686e1
sexplib0.v0.14.0 b1299c5fde0d
spawn.v0.17.0 4042875e0698
splittable_random.v0.14.0 030bfe94f949
stdio.v0.14.0 70b9e7101827
stdlib-shims.0.3.0 f92f058899fa
textutils.v0.14.0 37266eaa6882
time_now.v0.14.0 ae5a660e40fd
timezone.v0.14.0 0acd50679699
typerep.v0.14.0 e6d46b988435
variantslib.v0.14.0 7453275a0ce9
=== STDOUT ===
Processing: [default: loading data]
[async_ssl.v0.14.0: dl]
[async_ssl.v0.14.0: extract]
-> retrieved async_ssl.v0.14.0 (https://opam.ocaml.org/cache)
[async_ssl: dune build]
+ /home/opam/.opam/default/bin/dune "build" "-p" "async_ssl" "-j" "39" (CWD=/home/opam/.opam/default/.opam-switch/build/async_ssl.v0.14.0)
- (cd _build/default/bindings && /usr/bin/gcc -O2 -fno-strict-aliasing -fwrapv -pthread -fPIC -D_FILE_OFFSET_BITS=64 -O2 -fno-strict-aliasing -fwrapv -pthread -fPIC -g -I /home/opam/.opam/default/lib/ocaml -I /home/opam/.opam/default/lib/base -I /home/opam/.opam/default/lib/base/base_internalhash_types -I /home/opam/.opam/default/lib/base/caml -I /home/opam/.opam/default/lib/base/md5 -I /home/opam/.opam/default/lib/base/shadow_stdlib -I /home/opam/.opam/default/lib/base_quickcheck -I /home/opam/.opam/default/lib/bin_prot -I /home/opam/.opam/default/lib/bin_prot/shape -I /home/opam/.opam/default/lib/bytes -I /home/opam/.opam/default/lib/ctypes -I /home/opam/.opam/default/lib/fieldslib -I /home/opam/.opam/default/lib/integers -I /home/opam/.opam/default/lib/jane-street-headers -I /home/opam/.opam/default/lib/ocaml/threads -I /home/opam/.opam/default/lib/ppx_assert/runtime-lib -I /home/opam/.opam/default/lib/ppx_bench/runtime-lib -I /home/opam/.opam/default/lib/ppx_compare/runtime-lib -I /home/opam/.opam/default/lib/ppx_enumerate/runtime-lib -I /home/opam/.opam/default/lib/ppx_expect/collector -I /home/opam/.opam/default/lib/ppx_expect/common -I /home/opam/.opam/default/lib/ppx_expect/config -I /home/opam/.opam/default/lib/ppx_expect/config_types -I /home/opam/.opam/default/lib/ppx_hash/runtime-lib -I /home/opam/.opam/default/lib/ppx_here/runtime-lib -I /home/opam/.opam/default/lib/ppx_inline_test/config -I /home/opam/.opam/default/lib/ppx_inline_test/runtime-lib -I /home/opam/.opam/default/lib/ppx_module_timer/runtime -I /home/opam/.opam/default/lib/ppx_sexp_conv/runtime-lib -I /home/opam/.opam/default/lib/sexplib0 -I /home/opam/.opam/default/lib/splittable_random -I /home/opam/.opam/default/lib/stdio -I /home/opam/.opam/default/lib/stdlib-shims -I /home/opam/.opam/default/lib/time_now -I /home/opam/.opam/default/lib/typerep -I /home/opam/.opam/default/lib/variantslib -o openssl_helpers.o -c openssl_helpers.c)
- openssl_helpers.c: In function 'async_ssl__subject_alt_names':
- openssl_helpers.c:66:9: warning: 'ASN1_STRING_data' is deprecated: Since OpenSSL 1.1.0 [-Wdeprecated-declarations]
- 66 | cstr = ASN1_STRING_data(gen->d.dNSName);
- | ^~~~
- In file included from /usr/include/openssl/objects.h:21,
- from /usr/include/openssl/evp.h:47,
- from /usr/include/openssl/x509.h:31,
- from /usr/include/openssl/x509v3.h:27,
- from openssl_helpers.c:2:
- /usr/include/openssl/asn1.h:671:40: note: declared here
- 671 | OSSL_DEPRECATEDIN_1_1_0 unsigned char *ASN1_STRING_data(ASN1_STRING *x);
- | ^~~~~~~~~~~~~~~~
- File "src/dune", line 16, characters 10-29:
- 16 | (c_names ffi_generated_stubs) (flags :standard -w -9-27-32-34)
- ^^^^^^^^^^^^^^^^^^^
- (cd _build/default/src && /usr/bin/gcc -O2 -fno-strict-aliasing -fwrapv -pthread -fPIC -D_FILE_OFFSET_BITS=64 -O2 -fno-strict-aliasing -fwrapv -pthread -fPIC -w -g -I /home/opam/.opam/default/lib/ocaml -I /home/opam/.opam/default/lib/async -I /home/opam/.opam/default/lib/async/async_command -I /home/opam/.opam/default/lib/async/async_quickcheck -I /home/opam/.opam/default/lib/async/async_rpc -I /home/opam/.opam/default/lib/async_kernel -I /home/opam/.opam/default/lib/async_kernel/persistent_connection_kernel -I /home/opam/.opam/default/lib/async_rpc_kernel -I /home/opam/.opam/default/lib/async_unix -I /home/opam/.opam/default/lib/async_unix/thread_pool -I /home/opam/.opam/default/lib/async_unix/thread_safe_ivar -I /home/opam/.opam/default/lib/base -I /home/opam/.opam/default/lib/base/base_internalhash_types -I /home/opam/.opam/default/lib/base/caml -I /home/opam/.opam/default/lib/base/md5 -I /home/opam/.opam/default/lib/base/shadow_stdlib -I /home/opam/.opam/default/lib/base_bigstring -I /home/opam/.opam/default/lib/base_quickcheck -I /home/opam/.opam/default/lib/bin_prot -I /home/opam/.opam/default/lib/bin_prot/shape -I /home/opam/.opam/default/lib/bytes -I /home/opam/.opam/default/lib/core -I /home/opam/.opam/default/lib/core/bigstring_unix -I /home/opam/.opam/default/lib/core/error_checking_mutex -I /home/opam/.opam/default/lib/core/iobuf_unix -I /home/opam/.opam/default/lib/core/linux_ext -I /home/opam/.opam/default/lib/core/nano_mutex -I /home/opam/.opam/default/lib/core/squeue -I /home/opam/.opam/default/lib/core/time_stamp_counter -I /home/opam/.opam/default/lib/core/uuid -I /home/opam/.opam/default/lib/core_kernel -I /home/opam/.opam/default/lib/core_kernel/base_for_tests -I /home/opam/.opam/default/lib/core_kernel/bounded_int_table -I /home/opam/.opam/default/lib/core_kernel/caml_unix -I /home/opam/.opam/default/lib/core_kernel/flags -I /home/opam/.opam/default/lib/core_kernel/iobuf -I /home/opam/.opam/default/lib/core_kernel/moption -I /home/opam/.opam/default/lib/core_kernel/pairing_heap -I /home/opam/.opam/default/lib/core_kernel/sexp_hidden_in_test -I /home/opam/.opam/default/lib/core_kernel/thread_pool_cpu_affinity -I /home/opam/.opam/default/lib/core_kernel/thread_safe_queue -I /home/opam/.opam/default/lib/core_kernel/timing_wheel -I /home/opam/.opam/default/lib/core_kernel/tuple_pool -I /home/opam/.opam/default/lib/core_kernel/uopt -I /home/opam/.opam/default/lib/core_kernel/uuid -I /home/opam/.opam/default/lib/core_kernel/version_util -I /home/opam/.opam/default/lib/ctypes -I /home/opam/.opam/default/lib/fieldslib -I /home/opam/.opam/default/lib/integers -I /home/opam/.opam/default/lib/jane-street-headers -I /home/opam/.opam/default/lib/ocaml/threads -I /home/opam/.opam/default/lib/parsexp -I /home/opam/.opam/default/lib/ppx_assert/runtime-lib -I /home/opam/.opam/default/lib/ppx_bench/runtime-lib -I /home/opam/.opam/default/lib/ppx_compare/runtime-lib -I /home/opam/.opam/default/lib/ppx_enumerate/runtime-lib -I /home/opam/.opam/default/lib/ppx_expect/collector -I /home/opam/.opam/default/lib/ppx_expect/common -I /home/opam/.opam/default/lib/ppx_expect/config -I /home/opam/.opam/default/lib/ppx_expect/config_types -I /home/opam/.opam/default/lib/ppx_hash/runtime-lib -I /home/opam/.opam/default/lib/ppx_here/runtime-lib -I /home/opam/.opam/default/lib/ppx_inline_test/config -I /home/opam/.opam/default/lib/ppx_inline_test/runtime-lib -I /home/opam/.opam/default/lib/ppx_module_timer/runtime -I /home/opam/.opam/default/lib/ppx_sexp_conv/runtime-lib -I /home/opam/.opam/default/lib/protocol_version_header -I /home/opam/.opam/default/lib/sexplib -I /home/opam/.opam/default/lib/sexplib/unix -I /home/opam/.opam/default/lib/sexplib0 -I /home/opam/.opam/default/lib/spawn -I /home/opam/.opam/default/lib/splittable_random -I /home/opam/.opam/default/lib/stdio -I /home/opam/.opam/default/lib/stdlib-shims -I /home/opam/.opam/default/lib/time_now -I /home/opam/.opam/default/lib/timezone -I /home/opam/.opam/default/lib/typerep -I /home/opam/.opam/default/lib/variantslib -I ../bindings -o ffi_generated_stubs.o -c ffi_generated_stubs.c)
- ffi_generated_stubs.c: In function 'async_ssl_stub_14_ENGINE_load_builtin_engines':
- ffi_generated_stubs.c:80:4: error: implicit declaration of function 'ENGINE_load_builtin_engines' [-Wimplicit-function-declaration]
- 80 | ENGINE_load_builtin_engines();
- | ^~~~~~~~~~~~~~~~~~~~~~~~~~~
- ffi_generated_stubs.c: In function 'async_ssl_stub_15_ENGINE_unregister_RAND':
- ffi_generated_stubs.c:85:4: error: implicit declaration of function 'ENGINE_unregister_RAND' [-Wimplicit-function-declaration]
- 85 | ENGINE_unregister_RAND();
- | ^~~~~~~~~~~~~~~~~~~~~~
- ffi_generated_stubs.c: In function 'async_ssl_stub_16_ENGINE_register_all_complete':
- ffi_generated_stubs.c:90:4: error: implicit declaration of function 'ENGINE_register_all_complete' [-Wimplicit-function-declaration]
- 90 | ENGINE_register_all_complete();
- | ^~~~~~~~~~~~~~~~~~~~~~~~~~~~
- ffi_generated_stubs.c: In function 'async_ssl_stub_50_BN_hex2bn':
- ffi_generated_stubs.c:315:25: error: passing argument 1 of 'BN_hex2bn' from incompatible pointer type [-Wincompatible-pointer-types]
- 315 | int x199 = BN_hex2bn(x197, x198);
- | ^~~~
- | |
- | void **
- In file included from /usr/include/openssl/params.h:16,
- from /usr/include/openssl/indicator.h:18,
- from /usr/include/openssl/core_dispatch.h:16,
- from /usr/include/openssl/evp.h:28,
- from /usr/include/openssl/x509.h:31,
- from /usr/include/openssl/ssl.h:34,
- from ffi_generated_stubs.c:2:
- /usr/include/openssl/bn.h:345:24: note: expected 'BIGNUM **' {aka 'struct bignum_st **'} but argument is of type 'void **'
- 345 | int BN_hex2bn(BIGNUM **a, const char *str);
- | ~~~~~~~~~^
- ffi_generated_stubs.c: In function 'async_ssl_stub_72_SSL_set_tmp_dh_callback':
- ffi_generated_stubs.c:467:34: error: passing argument 2 of 'SSL_set_tmp_dh_callback' from incompatible pointer type [-Wincompatible-pointer-types]
- 467 | SSL_set_tmp_dh_callback(x320, x321);
- | ^~~~
- | |
- | void * (*)(void *, _Bool, int)
- /usr/include/openssl/ssl.h:2282:11: note: expected 'DH * (*)(SSL *, int, int)' {aka 'struct dh_st * (*)(struct ssl_st *, int, int)'} but argument is of type 'void * (*)(void *, _Bool, int)'
- 2282 | DH *(*dh)(SSL *ssl, int is_export,
- | ~~~~~~^~~~~~~~~~~~~~~~~~~~~~~~~~~~
- 2283 | int keylength));
- | ~~~~~~~~~~~~~~
[ERROR] The compilation of async_ssl.v0.14.0 failed at "dune build -p async_ssl -j 39".
build failed...
=== STDERR ===
2026-09-20 12:05.12: FAILED: build async_ssl.v0.14.0
2026-09-20 12:05.12: Job failed: build failed: async_ssl.v0.14.0