Build:
- 0
2026-09-20 11:32.38: New job: build async_ssl.v0.13.0 (b41834edf592)
2026-09-20 11:32.38: Waiting for resource in pool day11-builds
2026-09-20 12:02.56: Got resource from pool day11-builds
2026-09-20 12:02.56: [profile full] build async_ssl.v0.13.0
2026-09-20 12:02.57: build async_ssl.v0.13.0 (b41834edf592)
=== DEPENDENCIES (78 transitive) ===
async.v0.13.0 1aaf008f3673
async_kernel.v0.13.0 721a80e73706
async_rpc_kernel.v0.13.0 b0e5caad695c
async_unix.v0.13.1 24f162e01555
base.v0.13.2 c11baf5c67a8
base-threads.base ddcab511c589
base-unix.base 742554e1dbc2
base_bigstring.v0.13.0 f9cbb6f6a3b0
base_quickcheck.v0.13.0 bcbc041c93a2
bin_prot.v0.13.0 9d307a4acc57
conf-libffi.2.0.0 2de1e6fba1f5
conf-libssl.4 8f666ff3657c
conf-pkg-config.5 5bc8297bba82
core.v0.13.0 d357e9d3f9e3
core_kernel.v0.13.1 1833dcc579fb
csexp.1.5.2 e1d84f25c46d
ctypes.0.17.1 8fc6d723e839
ctypes-foreign.0.18.0 4ff1d07bf0ba
dune.3.24.2 b27a09bf6f27
dune-configurator.3.22.2 67f525e717c7
fieldslib.v0.13.0 8a9c75a2434f
integers.0.8.0 687579fb9841
jane-street-headers.v0.13.0 5c5b1b7451fe
jst-config.v0.13.0 53e13f1946f7
num.1.6 51f1bfd232d4
ocaml.4.11.2 724562efb759
ocaml-base-compiler.4.11.2 c280e835148d
ocaml-compiler-libs.v0.12.4 b8cc10bd4147
ocaml-config.1 f11ab3cebca9
ocaml-migrate-parsetree.1.8.0 cec0ee11abc1
ocaml-secondary-compiler.4.14.2 e2a22285b593
ocamlfind.1.9.6 45f86f2c0142
ocamlfind-secondary.1.9.6 fad26ecf706a
octavius.1.2.2 0402a676b2dc
parsexp.v0.13.0 18c46272346a
ppx_assert.v0.13.0 954e25fce75f
ppx_base.v0.13.0 73dc6787dc99
ppx_bench.v0.13.0 d437e23840c3
ppx_bin_prot.v0.13.0 0e9b5962f045
ppx_cold.v0.13.0 ea9685604364
ppx_compare.v0.13.0 a03b84d93afb
ppx_custom_printf.v0.13.0 6cf8375e7cd5
ppx_derivers.1.2.1 191b8c002db2
ppx_enumerate.v0.13.0 21ff5acde1e2
ppx_expect.v0.13.1 8a8b895029a9
ppx_fail.v0.13.0 23d4d07f7cda
ppx_fields_conv.v0.13.0 3a7aef00eaef
ppx_hash.v0.13.0 f807bbd26c9a
ppx_here.v0.13.0 7a87c7d96b28
ppx_inline_test.v0.13.1 57ff72f24d6e
ppx_jane.v0.13.0 ceac69e2c4a8
ppx_js_style.v0.13.0 0c48e642a33f
ppx_let.v0.13.0 a3c80af82180
ppx_module_timer.v0.13.0 0f89c5a947f5
ppx_optcomp.v0.13.0 73229e51a551
ppx_optional.v0.13.0 e96590fe0070
ppx_pipebang.v0.13.0 14a1ff54a8fe
ppx_sexp_conv.v0.13.0 a68b410ce370
ppx_sexp_message.v0.13.0 45fba923faca
ppx_sexp_value.v0.13.0 3031f7ca82e3
ppx_stable.v0.13.0 061d933f8f91
ppx_typerep_conv.v0.13.0 000e5a941f20
ppx_variants_conv.v0.13.0 6d76856b2d4b
ppxlib.0.13.0 4c4ff5bf0190
protocol_version_header.v0.13.0 650eab74188a
re.1.11.0 7eb460cdb8e7
result.1.5 641cb51b3aa9
seq.base 87d5b0f1b2a7
sexplib.v0.13.0 47c1185ba494
sexplib0.v0.13.0 cc0fe9f9e1b9
spawn.v0.17.0 a49de7e13049
splittable_random.v0.13.0 3eff7553cb08
stdio.v0.13.0 321a0107956f
stdlib-shims.0.3.0 10f620111cba
textutils.v0.13.0 441a64b6e45f
time_now.v0.13.0 695ef27e50e0
typerep.v0.13.0 fe44841ad2b2
variantslib.v0.13.0 658c1824763a
=== STDOUT ===
Processing: [default: loading data]
[async_ssl.v0.13.0: dl]
[async_ssl.v0.13.0: extract]
-> retrieved async_ssl.v0.13.0 (https://opam.ocaml.org/cache)
[async_ssl: dune build]
+ /home/opam/.opam/default/bin/dune "build" "-p" "async_ssl" "-j" "39" (CWD=/home/opam/.opam/default/.opam-switch/build/async_ssl.v0.13.0)
- (cd _build/default/bindings && /usr/bin/gcc -O2 -fno-strict-aliasing -fwrapv -fPIC -D_FILE_OFFSET_BITS=64 -D_REENTRANT -O2 -fno-strict-aliasing -fwrapv -fPIC -g -I /home/opam/.opam/default/lib/ocaml -I /home/opam/.opam/default/lib/base -I /home/opam/.opam/default/lib/base/base_internalhash_types -I /home/opam/.opam/default/lib/base/caml -I /home/opam/.opam/default/lib/base/md5 -I /home/opam/.opam/default/lib/base/shadow_stdlib -I /home/opam/.opam/default/lib/base_quickcheck -I /home/opam/.opam/default/lib/bin_prot -I /home/opam/.opam/default/lib/bin_prot/shape -I /home/opam/.opam/default/lib/bytes -I /home/opam/.opam/default/lib/ctypes -I /home/opam/.opam/default/lib/fieldslib -I /home/opam/.opam/default/lib/integers -I /home/opam/.opam/default/lib/jane-street-headers -I /home/opam/.opam/default/lib/ocaml/threads -I /home/opam/.opam/default/lib/ppx_assert/runtime-lib -I /home/opam/.opam/default/lib/ppx_bench/runtime-lib -I /home/opam/.opam/default/lib/ppx_compare/runtime-lib -I /home/opam/.opam/default/lib/ppx_enumerate/runtime-lib -I /home/opam/.opam/default/lib/ppx_expect/collector -I /home/opam/.opam/default/lib/ppx_expect/common -I /home/opam/.opam/default/lib/ppx_expect/config -I /home/opam/.opam/default/lib/ppx_hash/runtime-lib -I /home/opam/.opam/default/lib/ppx_here/runtime-lib -I /home/opam/.opam/default/lib/ppx_inline_test/config -I /home/opam/.opam/default/lib/ppx_inline_test/runtime-lib -I /home/opam/.opam/default/lib/ppx_module_timer/runtime -I /home/opam/.opam/default/lib/ppx_sexp_conv/runtime-lib -I /home/opam/.opam/default/lib/sexplib0 -I /home/opam/.opam/default/lib/splittable_random -I /home/opam/.opam/default/lib/stdio -I /home/opam/.opam/default/lib/stdlib-shims -I /home/opam/.opam/default/lib/time_now -I /home/opam/.opam/default/lib/typerep -I /home/opam/.opam/default/lib/variantslib -o openssl_helpers.o -c openssl_helpers.c)
- openssl_helpers.c: In function 'async_ssl__subject_alt_names':
- openssl_helpers.c:66:9: warning: 'ASN1_STRING_data' is deprecated: Since OpenSSL 1.1.0 [-Wdeprecated-declarations]
- 66 | cstr = ASN1_STRING_data(gen->d.dNSName);
- | ^~~~
- In file included from /usr/include/openssl/objects.h:21,
- from /usr/include/openssl/evp.h:47,
- from /usr/include/openssl/x509.h:31,
- from /usr/include/openssl/x509v3.h:27,
- from openssl_helpers.c:2:
- /usr/include/openssl/asn1.h:671:40: note: declared here
- 671 | OSSL_DEPRECATEDIN_1_1_0 unsigned char *ASN1_STRING_data(ASN1_STRING *x);
- | ^~~~~~~~~~~~~~~~
- File "src/dune", line 16, characters 10-29:
- 16 | (c_names ffi_generated_stubs) (flags :standard -w -9-27-32-34)
- ^^^^^^^^^^^^^^^^^^^
- (cd _build/default/src && /usr/bin/gcc -O2 -fno-strict-aliasing -fwrapv -fPIC -D_FILE_OFFSET_BITS=64 -D_REENTRANT -O2 -fno-strict-aliasing -fwrapv -fPIC -w -g -I /home/opam/.opam/default/lib/ocaml -I /home/opam/.opam/default/lib/async -I /home/opam/.opam/default/lib/async/async_command -I /home/opam/.opam/default/lib/async/async_quickcheck -I /home/opam/.opam/default/lib/async/async_rpc -I /home/opam/.opam/default/lib/async_kernel -I /home/opam/.opam/default/lib/async_kernel/persistent_connection_kernel -I /home/opam/.opam/default/lib/async_rpc_kernel -I /home/opam/.opam/default/lib/async_unix -I /home/opam/.opam/default/lib/async_unix/thread_pool -I /home/opam/.opam/default/lib/async_unix/thread_safe_ivar -I /home/opam/.opam/default/lib/base -I /home/opam/.opam/default/lib/base/base_internalhash_types -I /home/opam/.opam/default/lib/base/caml -I /home/opam/.opam/default/lib/base/md5 -I /home/opam/.opam/default/lib/base/shadow_stdlib -I /home/opam/.opam/default/lib/base_bigstring -I /home/opam/.opam/default/lib/base_quickcheck -I /home/opam/.opam/default/lib/bin_prot -I /home/opam/.opam/default/lib/bin_prot/shape -I /home/opam/.opam/default/lib/bytes -I /home/opam/.opam/default/lib/core -I /home/opam/.opam/default/lib/core/error_checking_mutex -I /home/opam/.opam/default/lib/core/nano_mutex -I /home/opam/.opam/default/lib/core/squeue -I /home/opam/.opam/default/lib/core/time_stamp_counter -I /home/opam/.opam/default/lib/core/uuid -I /home/opam/.opam/default/lib/core_kernel -I /home/opam/.opam/default/lib/core_kernel/base_for_tests -I /home/opam/.opam/default/lib/core_kernel/bounded_int_table -I /home/opam/.opam/default/lib/core_kernel/flags -I /home/opam/.opam/default/lib/core_kernel/moption -I /home/opam/.opam/default/lib/core_kernel/pairing_heap -I /home/opam/.opam/default/lib/core_kernel/thread_pool_cpu_affinity -I /home/opam/.opam/default/lib/core_kernel/thread_safe_queue -I /home/opam/.opam/default/lib/core_kernel/timing_wheel -I /home/opam/.opam/default/lib/core_kernel/tuple_pool -I /home/opam/.opam/default/lib/core_kernel/uopt -I /home/opam/.opam/default/lib/core_kernel/uuid -I /home/opam/.opam/default/lib/core_kernel/version_util -I /home/opam/.opam/default/lib/ctypes -I /home/opam/.opam/default/lib/fieldslib -I /home/opam/.opam/default/lib/integers -I /home/opam/.opam/default/lib/jane-street-headers -I /home/opam/.opam/default/lib/ocaml/threads -I /home/opam/.opam/default/lib/parsexp -I /home/opam/.opam/default/lib/ppx_assert/runtime-lib -I /home/opam/.opam/default/lib/ppx_bench/runtime-lib -I /home/opam/.opam/default/lib/ppx_compare/runtime-lib -I /home/opam/.opam/default/lib/ppx_enumerate/runtime-lib -I /home/opam/.opam/default/lib/ppx_expect/collector -I /home/opam/.opam/default/lib/ppx_expect/common -I /home/opam/.opam/default/lib/ppx_expect/config -I /home/opam/.opam/default/lib/ppx_hash/runtime-lib -I /home/opam/.opam/default/lib/ppx_here/runtime-lib -I /home/opam/.opam/default/lib/ppx_inline_test/config -I /home/opam/.opam/default/lib/ppx_inline_test/runtime-lib -I /home/opam/.opam/default/lib/ppx_module_timer/runtime -I /home/opam/.opam/default/lib/ppx_sexp_conv/runtime-lib -I /home/opam/.opam/default/lib/protocol_version_header -I /home/opam/.opam/default/lib/sexplib -I /home/opam/.opam/default/lib/sexplib/unix -I /home/opam/.opam/default/lib/sexplib0 -I /home/opam/.opam/default/lib/spawn -I /home/opam/.opam/default/lib/splittable_random -I /home/opam/.opam/default/lib/stdio -I /home/opam/.opam/default/lib/stdlib-shims -I /home/opam/.opam/default/lib/time_now -I /home/opam/.opam/default/lib/typerep -I /home/opam/.opam/default/lib/variantslib -I ../bindings -o ffi_generated_stubs.o -c ffi_generated_stubs.c)
- ffi_generated_stubs.c: In function 'async_ssl_stub_14_ENGINE_load_builtin_engines':
- ffi_generated_stubs.c:80:4: error: implicit declaration of function 'ENGINE_load_builtin_engines' [-Wimplicit-function-declaration]
- 80 | ENGINE_load_builtin_engines();
- | ^~~~~~~~~~~~~~~~~~~~~~~~~~~
- ffi_generated_stubs.c: In function 'async_ssl_stub_15_ENGINE_unregister_RAND':
- ffi_generated_stubs.c:85:4: error: implicit declaration of function 'ENGINE_unregister_RAND' [-Wimplicit-function-declaration]
- 85 | ENGINE_unregister_RAND();
- | ^~~~~~~~~~~~~~~~~~~~~~
- ffi_generated_stubs.c: In function 'async_ssl_stub_16_ENGINE_register_all_complete':
- ffi_generated_stubs.c:90:4: error: implicit declaration of function 'ENGINE_register_all_complete' [-Wimplicit-function-declaration]
- 90 | ENGINE_register_all_complete();
- | ^~~~~~~~~~~~~~~~~~~~~~~~~~~~
- ffi_generated_stubs.c: In function 'async_ssl_stub_47_BN_hex2bn':
- ffi_generated_stubs.c:289:25: error: passing argument 1 of 'BN_hex2bn' from incompatible pointer type [-Wincompatible-pointer-types]
- 289 | int x176 = BN_hex2bn(x174, x175);
- | ^~~~
- | |
- | void **
- In file included from /usr/include/openssl/params.h:16,
- from /usr/include/openssl/indicator.h:18,
- from /usr/include/openssl/core_dispatch.h:16,
- from /usr/include/openssl/evp.h:28,
- from /usr/include/openssl/x509.h:31,
- from /usr/include/openssl/ssl.h:34,
- from ffi_generated_stubs.c:2:
- /usr/include/openssl/bn.h:345:24: note: expected 'BIGNUM **' {aka 'struct bignum_st **'} but argument is of type 'void **'
- 345 | int BN_hex2bn(BIGNUM **a, const char *str);
- | ~~~~~~~~~^
- ffi_generated_stubs.c: In function 'async_ssl_stub_71_SSL_set_tmp_dh_callback':
- ffi_generated_stubs.c:459:34: error: passing argument 2 of 'SSL_set_tmp_dh_callback' from incompatible pointer type [-Wincompatible-pointer-types]
- 459 | SSL_set_tmp_dh_callback(x315, x316);
- | ^~~~
- | |
- | void * (*)(void *, _Bool, int)
- /usr/include/openssl/ssl.h:2282:11: note: expected 'DH * (*)(SSL *, int, int)' {aka 'struct dh_st * (*)(struct ssl_st *, int, int)'} but argument is of type 'void * (*)(void *, _Bool, int)'
- 2282 | DH *(*dh)(SSL *ssl, int is_export,
- | ~~~~~~^~~~~~~~~~~~~~~~~~~~~~~~~~~~
- 2283 | int keylength));
- | ~~~~~~~~~~~~~~
[ERROR] The compilation of async_ssl.v0.13.0 failed at "dune build -p async_ssl -j 39".
build failed...
=== STDERR ===
2026-09-20 12:03.54: FAILED: build async_ssl.v0.13.0
2026-09-20 12:03.54: Job failed: build failed: async_ssl.v0.13.0