Build:
  1. 0
2026-09-20 11:01.19: New job: build js_of_ocaml-webidl.0.1 (2421e861138e)
2026-09-20 11:01.19: Waiting for resource in pool day11-builds
2026-09-20 11:32.41: Got resource from pool day11-builds
2026-09-20 11:32.41: [profile full] build js_of_ocaml-webidl.0.1
2026-09-20 11:32.41: build js_of_ocaml-webidl.0.1 (2421e861138e)
=== DEPENDENCIES (90 transitive) ===
  async.v0.14.0                                      21088aeb886a
  async_kernel.v0.14.0                               cb345b99386d
  async_rpc_kernel.v0.14.0                           c179e5b4cd44
  async_unix.v0.14.0                                 6e6a8f10c946
  base.v0.14.4                                       3ae13eece5cf
  base-bytes.base                                    04136fa766e9
  base-threads.base                                  ddcab511c589
  base-unix.base                                     742554e1dbc2
  base_bigstring.v0.14.0                             e5d22941f2a7
  base_quickcheck.v0.14.1                            0dadfc062195
  bin_prot.v0.14.1                                   cd2e296d959e
  cmdliner.2.1.1                                     76b99d0928a2
  core.v0.14.1                                       9dcbfcb29380
  core_kernel.v0.14.2                                a39e995b7605
  cppo.1.8.0                                         69763fa650c4
  csexp.1.5.2                                        317f9c7d3156
  dune.3.24.2                                        1c2746b9e506
  dune-configurator.3.24.2                           ed0d787fca30
  fieldslib.v0.14.0                                  5bdc067afc1a
  gen.1.1                                            f518bdb996c2
  jane-street-headers.v0.14.0                        eabcc3ae2cf6
  js_of_ocaml.5.8.2                                  cecffa880ebb
  js_of_ocaml-compiler.5.8.2                         0322db2be0e1
  js_of_ocaml-lwt.5.8.2                              b2a604513cb4
  js_of_ocaml-ppx.5.8.2                              048ca118f68f
  jst-config.v0.14.1                                 30e542f41d48
  lwt.6.1.2                                          7648a82d38f5
  menhir.20211128                                    9536280327f4
  menhirLib.20211128                                 51bb0b5e3c86
  menhirSdk.20211128                                 292856a87d5a
  num.1.6                                            3fc01160eb55
  ocaml.4.14.2                                       7909c4d9791e
  ocaml-base-compiler.4.14.2                         d137f6079776
  ocaml-compiler-libs.v0.12.4                        15460c02e696
  ocaml-config.2                                     3391ed267e74
  ocamlbuild.0.16.1                                  0053917cfc96
  ocamlfind.1.9.8                                    c664fd969026
  ocplib-endian.1.2                                  8107cfa844eb
  octavius.1.2.2                                     bd0050877b46
  parsexp.v0.14.2                                    e24e166c223e
  ppx_assert.v0.14.0                                 1cedb0d5df03
  ppx_base.v0.14.0                                   e554b5a3d39f
  ppx_bench.v0.14.1                                  5b6dd4e2e00b
  ppx_bin_prot.v0.14.0                               e0226e69db5c
  ppx_cold.v0.14.0                                   d63695335c7a
  ppx_compare.v0.14.0                                db43e0c9bdb8
  ppx_custom_printf.v0.14.1                          4a94a597ae0e
  ppx_derivers.1.2.1                                 62363aeabaa3
  ppx_deriving.5.2.1                                 a138db95fa73
  ppx_enumerate.v0.14.0                              d4119d0e6d71
  ppx_expect.v0.14.2                                 8e6678c469fe
  ppx_fields_conv.v0.14.2                            f57b75d9bd1a
  ppx_fixed_literal.v0.14.0                          c705dc8be0f0
  ppx_hash.v0.14.0                                   e003027bb00d
  ppx_here.v0.14.0                                   3da88b75f272
  ppx_inline_test.v0.14.1                            451e468d6d77
  ppx_jane.v0.14.0                                   914311a3d50f
  ppx_js_style.v0.14.1                               a78d94fb3af8
  ppx_let.v0.14.0                                    8d9b4d408869
  ppx_module_timer.v0.14.0                           e5743d995ef3
  ppx_optcomp.v0.14.3                                362417a24464
  ppx_optional.v0.14.0                               2eb04d5accf9
  ppx_pipebang.v0.14.0                               198380b04aa8
  ppx_sexp_conv.v0.14.3                              b42c80b855c1
  ppx_sexp_message.v0.14.1                           81b58f3c366f
  ppx_sexp_value.v0.14.0                             abc2370f7697
  ppx_stable.v0.14.1                                 1815a4add815
  ppx_string.v0.14.1                                 03d8bcfd1e6a
  ppx_typerep_conv.v0.14.2                           b4812a9162c4
  ppx_variants_conv.v0.14.2                          4ba24c278bd1
  ppxlib.0.25.1                                      ad8d78a5adbc
  protocol_version_header.v0.14.0                    e3cb51a241cb
  re.1.14.0                                          2987fccd3f1c
  result.1.5                                         b10e7943fee3
  sedlex.2.5                                         0cc1f53cad8a
  seq.base                                           8099822c4f43
  sexplib.v0.14.0                                    69cd64da05ea
  sexplib0.v0.14.0                                   31ab9dc6dc05
  spawn.v0.17.0                                      66a545f8782a
  splittable_random.v0.14.0                          faf3083c7aa7
  stdio.v0.14.0                                      fe412091b218
  stdlib-shims.0.3.0                                 3aac433b25e9
  textutils.v0.14.0                                  b6399cf04e82
  time_now.v0.14.0                                   a8256f0668e1
  timezone.v0.14.0                                   4b77900379a7
  typerep.v0.14.0                                    971d7dc0b0ca
  uchar.0.0.2                                        273f92e94d64
  variantslib.v0.14.0                                af2d058fcbda
  webidl.1.4                                         e0458e1f3fbf
  yojson.3.0.0                                       f75eb6f6259d
=== STDOUT ===
Processing: [default: loading data]
[js_of_ocaml-webidl.0.1: dl]
[js_of_ocaml-webidl.0.1: extract]
-> retrieved js_of_ocaml-webidl.0.1  (https://opam.ocaml.org/cache)
[js_of_ocaml-webidl: dune build]
+ /home/opam/.opam/default/bin/dune "build" "-p" "js_of_ocaml-webidl" "-j" "39" "@install" (CWD=/home/opam/.opam/default/.opam-switch/build/js_of_ocaml-webidl.0.1)
- (cd _build/default && /home/opam/.opam/default/bin/menhir --unused-tokens --external-tokens Tokens webidl/src/syntax/non_standard.mly webidl/src/syntax/parser.mly webidl/src/syntax/parser_custom_ext.mly webidl/src/syntax/tokens.mly --base webidl/src/syntax/parser --infer-write-query webidl/src/syntax/parser__mock.ml.mock)
- File "webidl/src/syntax/non_standard.mly", line 29, characters 8-30:
- Warning: symbol attributeSerializetion is unreachable from any of the start symbol(s).
- File "webidl/src/syntax/parser.mly", line 242, characters 8-19:
- Warning: symbol identifiers is unreachable from any of the start symbol(s).
- (cd _build/default && /home/opam/.opam/default/bin/menhir --unused-tokens --external-tokens Tokens webidl/src/syntax/non_standard.mly webidl/src/syntax/parser.mly webidl/src/syntax/parser_basic_ext.mly webidl/src/syntax/tokens.mly --base webidl/src/syntax/parser_extend --infer-write-query webidl/src/syntax/parser_extend__mock.ml.mock)
- File "webidl/src/syntax/non_standard.mly", line 29, characters 8-30:
- Warning: symbol attributeSerializetion is unreachable from any of the start symbol(s).
- File "webidl/src/syntax/non_standard.mly", line 32, characters 8-17:
- Warning: symbol commnaEnd is unreachable from any of the start symbol(s).
- File "webidl/src/syntax/non_standard.mly", line 35, characters 8-34:
- Warning: symbol emptyExtendedAttributeList is unreachable from any of the start symbol(s).
- (cd _build/default && /home/opam/.opam/default/bin/ocamlc.opt -w -40 -w +a-4-40-41-42-44-45-48-33 -g -bin-annot -I webidl/src/syntax/.webidl_syntax.objs/byte -I /home/opam/.opam/default/lib/base -I /home/opam/.opam/default/lib/base/base_internalhash_types -I /home/opam/.opam/default/lib/base/caml -I /home/opam/.opam/default/lib/base/md5 -I /home/opam/.opam/default/lib/base/shadow_stdlib -I /home/opam/.opam/default/lib/base_bigstring -I /home/opam/.opam/default/lib/base_quickcheck -I /home/opam/.opam/default/lib/bin_prot -I /home/opam/.opam/default/lib/bin_prot/shape -I /home/opam/.opam/default/lib/core -I /home/opam/.opam/default/lib/core/error_checking_mutex -I /home/opam/.opam/default/lib/core_kernel -I /home/opam/.opam/default/lib/core_kernel/base_for_tests -I /home/opam/.opam/default/lib/core_kernel/caml_unix -I /home/opam/.opam/default/lib/core_kernel/flags -I /home/opam/.opam/default/lib/core_kernel/version_util -I /home/opam/.opam/default/lib/fieldslib -I /home/opam/.opam/default/lib/jane-street-headers -I /home/opam/.opam/default/lib/ocaml/threads -I /home/opam/.opam/default/lib/parsexp -I /home/opam/.opam/default/lib/ppx_assert/runtime-lib -I /home/opam/.opam/default/lib/ppx_bench/runtime-lib -I /home/opam/.opam/default/lib/ppx_compare/runtime-lib -I /home/opam/.opam/default/lib/ppx_enumerate/runtime-lib -I /home/opam/.opam/default/lib/ppx_expect/collector -I /home/opam/.opam/default/lib/ppx_expect/common -I /home/opam/.opam/default/lib/ppx_expect/config -I /home/opam/.opam/default/lib/ppx_expect/config_types -I /home/opam/.opam/default/lib/ppx_hash/runtime-lib -I /home/opam/.opam/default/lib/ppx_here/runtime-lib -I /home/opam/.opam/default/lib/ppx_inline_test/config -I /home/opam/.opam/default/lib/ppx_inline_test/runtime-lib -I /home/opam/.opam/default/lib/ppx_module_timer/runtime -I /home/opam/.opam/default/lib/ppx_sexp_conv/runtime-lib -I /home/opam/.opam/default/lib/sexplib -I /home/opam/.opam/default/lib/sexplib/unix -I /home/opam/.opam/default/lib/sexplib0 -I /home/opam/.opam/default/lib/spawn -I /home/opam/.opam/default/lib/splittable_random -I /home/opam/.opam/default/lib/stdio -I /home/opam/.opam/default/lib/time_now -I /home/opam/.opam/default/lib/timezone -I /home/opam/.opam/default/lib/typerep -I /home/opam/.opam/default/lib/variantslib -no-alias-deps -open Webidl_syntax -o webidl/src/syntax/.webidl_syntax.objs/byte/webidl_syntax__Keyword.cmo -c -impl webidl/src/syntax/keyword.pp.ml)
- File "webidl/src/syntax/keyword.pp.ml", line 1:
- Warning 70 [missing-mli]: Cannot find interface file.
- (cd _build/default && /home/opam/.opam/default/bin/ocamlc.opt -w -40 -w +a-4-40-41-42-44-45-48-33 -g -bin-annot -I webidl/src/syntax/.webidl_syntax.objs/byte -I /home/opam/.opam/default/lib/base -I /home/opam/.opam/default/lib/base/base_internalhash_types -I /home/opam/.opam/default/lib/base/caml -I /home/opam/.opam/default/lib/base/md5 -I /home/opam/.opam/default/lib/base/shadow_stdlib -I /home/opam/.opam/default/lib/base_bigstring -I /home/opam/.opam/default/lib/base_quickcheck -I /home/opam/.opam/default/lib/bin_prot -I /home/opam/.opam/default/lib/bin_prot/shape -I /home/opam/.opam/default/lib/core -I /home/opam/.opam/default/lib/core/error_checking_mutex -I /home/opam/.opam/default/lib/core_kernel -I /home/opam/.opam/default/lib/core_kernel/base_for_tests -I /home/opam/.opam/default/lib/core_kernel/caml_unix -I /home/opam/.opam/default/lib/core_kernel/flags -I /home/opam/.opam/default/lib/core_kernel/version_util -I /home/opam/.opam/default/lib/fieldslib -I /home/opam/.opam/default/lib/jane-street-headers -I /home/opam/.opam/default/lib/ocaml/threads -I /home/opam/.opam/default/lib/parsexp -I /home/opam/.opam/default/lib/ppx_assert/runtime-lib -I /home/opam/.opam/default/lib/ppx_bench/runtime-lib -I /home/opam/.opam/default/lib/ppx_compare/runtime-lib -I /home/opam/.opam/default/lib/ppx_enumerate/runtime-lib -I /home/opam/.opam/default/lib/ppx_expect/collector -I /home/opam/.opam/default/lib/ppx_expect/common -I /home/opam/.opam/default/lib/ppx_expect/config -I /home/opam/.opam/default/lib/ppx_expect/config_types -I /home/opam/.opam/default/lib/ppx_hash/runtime-lib -I /home/opam/.opam/default/lib/ppx_here/runtime-lib -I /home/opam/.opam/default/lib/ppx_inline_test/config -I /home/opam/.opam/default/lib/ppx_inline_test/runtime-lib -I /home/opam/.opam/default/lib/ppx_module_timer/runtime -I /home/opam/.opam/default/lib/ppx_sexp_conv/runtime-lib -I /home/opam/.opam/default/lib/sexplib -I /home/opam/.opam/default/lib/sexplib/unix -I /home/opam/.opam/default/lib/sexplib0 -I /home/opam/.opam/default/lib/spawn -I /home/opam/.opam/default/lib/splittable_random -I /home/opam/.opam/default/lib/stdio -I /home/opam/.opam/default/lib/time_now -I /home/opam/.opam/default/lib/timezone -I /home/opam/.opam/default/lib/typerep -I /home/opam/.opam/default/lib/variantslib -no-alias-deps -open Webidl_syntax -o webidl/src/syntax/.webidl_syntax.objs/byte/webidl_syntax__Ast.cmo -c -impl webidl/src/syntax/ast.pp.ml)
- File "webidl/src/syntax/ast.pp.ml", line 1:
- Warning 70 [missing-mli]: Cannot find interface file.
- (cd _build/default && /home/opam/.opam/default/bin/ocamlc.opt -w -40 -w +a-4-40-41-42-44-45-48-33 -g -bin-annot -I webidl/src/syntax/.webidl_syntax.objs/byte -I /home/opam/.opam/default/lib/base -I /home/opam/.opam/default/lib/base/base_internalhash_types -I /home/opam/.opam/default/lib/base/caml -I /home/opam/.opam/default/lib/base/md5 -I /home/opam/.opam/default/lib/base/shadow_stdlib -I /home/opam/.opam/default/lib/base_bigstring -I /home/opam/.opam/default/lib/base_quickcheck -I /home/opam/.opam/default/lib/bin_prot -I /home/opam/.opam/default/lib/bin_prot/shape -I /home/opam/.opam/default/lib/core -I /home/opam/.opam/default/lib/core/error_checking_mutex -I /home/opam/.opam/default/lib/core_kernel -I /home/opam/.opam/default/lib/core_kernel/base_for_tests -I /home/opam/.opam/default/lib/core_kernel/caml_unix -I /home/opam/.opam/default/lib/core_kernel/flags -I /home/opam/.opam/default/lib/core_kernel/version_util -I /home/opam/.opam/default/lib/fieldslib -I /home/opam/.opam/default/lib/jane-street-headers -I /home/opam/.opam/default/lib/ocaml/threads -I /home/opam/.opam/default/lib/parsexp -I /home/opam/.opam/default/lib/ppx_assert/runtime-lib -I /home/opam/.opam/default/lib/ppx_bench/runtime-lib -I /home/opam/.opam/default/lib/ppx_compare/runtime-lib -I /home/opam/.opam/default/lib/ppx_enumerate/runtime-lib -I /home/opam/.opam/default/lib/ppx_expect/collector -I /home/opam/.opam/default/lib/ppx_expect/common -I /home/opam/.opam/default/lib/ppx_expect/config -I /home/opam/.opam/default/lib/ppx_expect/config_types -I /home/opam/.opam/default/lib/ppx_hash/runtime-lib -I /home/opam/.opam/default/lib/ppx_here/runtime-lib -I /home/opam/.opam/default/lib/ppx_inline_test/config -I /home/opam/.opam/default/lib/ppx_inline_test/runtime-lib -I /home/opam/.opam/default/lib/ppx_module_timer/runtime -I /home/opam/.opam/default/lib/ppx_sexp_conv/runtime-lib -I /home/opam/.opam/default/lib/sexplib -I /home/opam/.opam/default/lib/sexplib/unix -I /home/opam/.opam/default/lib/sexplib0 -I /home/opam/.opam/default/lib/spawn -I /home/opam/.opam/default/lib/splittable_random -I /home/opam/.opam/default/lib/stdio -I /home/opam/.opam/default/lib/time_now -I /home/opam/.opam/default/lib/timezone -I /home/opam/.opam/default/lib/typerep -I /home/opam/.opam/default/lib/variantslib -no-alias-deps -open Webidl_syntax -o webidl/src/syntax/.webidl_syntax.objs/byte/webidl_syntax__Parser_extend.cmi -c -intf webidl/src/syntax/parser_extend.pp.mli)
- File "webidl/src/syntax/parser_extend.mli", line 3, characters 11-16:
- 3 |           (Param : sig
-                ^^^^^
- Warning 67 [unused-functor-parameter]: unused functor parameter Param.
- (cd _build/default && /home/opam/.opam/default/bin/ocamlc.opt -w -40 -w +a-4-40-41-42-44-45-48-33 -g -bin-annot -I webidl/src/syntax/.webidl_syntax.objs/byte -I /home/opam/.opam/default/lib/base -I /home/opam/.opam/default/lib/base/base_internalhash_types -I /home/opam/.opam/default/lib/base/caml -I /home/opam/.opam/default/lib/base/md5 -I /home/opam/.opam/default/lib/base/shadow_stdlib -I /home/opam/.opam/default/lib/base_bigstring -I /home/opam/.opam/default/lib/base_quickcheck -I /home/opam/.opam/default/lib/bin_prot -I /home/opam/.opam/default/lib/bin_prot/shape -I /home/opam/.opam/default/lib/core -I /home/opam/.opam/default/lib/core/error_checking_mutex -I /home/opam/.opam/default/lib/core_kernel -I /home/opam/.opam/default/lib/core_kernel/base_for_tests -I /home/opam/.opam/default/lib/core_kernel/caml_unix -I /home/opam/.opam/default/lib/core_kernel/flags -I /home/opam/.opam/default/lib/core_kernel/version_util -I /home/opam/.opam/default/lib/fieldslib -I /home/opam/.opam/default/lib/jane-street-headers -I /home/opam/.opam/default/lib/ocaml/threads -I /home/opam/.opam/default/lib/parsexp -I /home/opam/.opam/default/lib/ppx_assert/runtime-lib -I /home/opam/.opam/default/lib/ppx_bench/runtime-lib -I /home/opam/.opam/default/lib/ppx_compare/runtime-lib -I /home/opam/.opam/default/lib/ppx_enumerate/runtime-lib -I /home/opam/.opam/default/lib/ppx_expect/collector -I /home/opam/.opam/default/lib/ppx_expect/common -I /home/opam/.opam/default/lib/ppx_expect/config -I /home/opam/.opam/default/lib/ppx_expect/config_types -I /home/opam/.opam/default/lib/ppx_hash/runtime-lib -I /home/opam/.opam/default/lib/ppx_here/runtime-lib -I /home/opam/.opam/default/lib/ppx_inline_test/config -I /home/opam/.opam/default/lib/ppx_inline_test/runtime-lib -I /home/opam/.opam/default/lib/ppx_module_timer/runtime -I /home/opam/.opam/default/lib/ppx_sexp_conv/runtime-lib -I /home/opam/.opam/default/lib/sexplib -I /home/opam/.opam/default/lib/sexplib/unix -I /home/opam/.opam/default/lib/sexplib0 -I /home/opam/.opam/default/lib/spawn -I /home/opam/.opam/default/lib/splittable_random -I /home/opam/.opam/default/lib/stdio -I /home/opam/.opam/default/lib/time_now -I /home/opam/.opam/default/lib/timezone -I /home/opam/.opam/default/lib/typerep -I /home/opam/.opam/default/lib/variantslib -no-alias-deps -open Webidl_syntax -o webidl/src/syntax/.webidl_syntax.objs/byte/webidl_syntax__Parser.cmi -c -intf webidl/src/syntax/parser.pp.mli)
- File "webidl/src/syntax/parser.mli", line 3, characters 11-16:
- 3 |           (Param : sig
-                ^^^^^
- Warning 67 [unused-functor-parameter]: unused functor parameter Param.
- File "webidl/src/syntax/parser.mli", line 6, characters 11-25:
- 6 |           (Parse_extended : sig
-                ^^^^^^^^^^^^^^
- Warning 67 [unused-functor-parameter]: unused functor parameter Parse_extended.
- (cd _build/default && /home/opam/.opam/default/bin/ocamlc.opt -w -40 -w +a-4-40-41-42-44-45-48-33 -g -bin-annot -I webidl/src/syntax/.webidl_syntax.objs/byte -I /home/opam/.opam/default/lib/base -I /home/opam/.opam/default/lib/base/base_internalhash_types -I /home/opam/.opam/default/lib/base/caml -I /home/opam/.opam/default/lib/base/md5 -I /home/opam/.opam/default/lib/base/shadow_stdlib -I /home/opam/.opam/default/lib/base_bigstring -I /home/opam/.opam/default/lib/base_quickcheck -I /home/opam/.opam/default/lib/bin_prot -I /home/opam/.opam/default/lib/bin_prot/shape -I /home/opam/.opam/default/lib/core -I /home/opam/.opam/default/lib/core/error_checking_mutex -I /home/opam/.opam/default/lib/core_kernel -I /home/opam/.opam/default/lib/core_kernel/base_for_tests -I /home/opam/.opam/default/lib/core_kernel/caml_unix -I /home/opam/.opam/default/lib/core_kernel/flags -I /home/opam/.opam/default/lib/core_kernel/version_util -I /home/opam/.opam/default/lib/fieldslib -I /home/opam/.opam/default/lib/jane-street-headers -I /home/opam/.opam/default/lib/ocaml/threads -I /home/opam/.opam/default/lib/parsexp -I /home/opam/.opam/default/lib/ppx_assert/runtime-lib -I /home/opam/.opam/default/lib/ppx_bench/runtime-lib -I /home/opam/.opam/default/lib/ppx_compare/runtime-lib -I /home/opam/.opam/default/lib/ppx_enumerate/runtime-lib -I /home/opam/.opam/default/lib/ppx_expect/collector -I /home/opam/.opam/default/lib/ppx_expect/common -I /home/opam/.opam/default/lib/ppx_expect/config -I /home/opam/.opam/default/lib/ppx_expect/config_types -I /home/opam/.opam/default/lib/ppx_hash/runtime-lib -I /home/opam/.opam/default/lib/ppx_here/runtime-lib -I /home/opam/.opam/default/lib/ppx_inline_test/config -I /home/opam/.opam/default/lib/ppx_inline_test/runtime-lib -I /home/opam/.opam/default/lib/ppx_module_timer/runtime -I /home/opam/.opam/default/lib/ppx_sexp_conv/runtime-lib -I /home/opam/.opam/default/lib/sexplib -I /home/opam/.opam/default/lib/sexplib/unix -I /home/opam/.opam/default/lib/sexplib0 -I /home/opam/.opam/default/lib/spawn -I /home/opam/.opam/default/lib/splittable_random -I /home/opam/.opam/default/lib/stdio -I /home/opam/.opam/default/lib/time_now -I /home/opam/.opam/default/lib/timezone -I /home/opam/.opam/default/lib/typerep -I /home/opam/.opam/default/lib/variantslib -no-alias-deps -open Webidl_syntax -o webidl/src/syntax/.webidl_syntax.objs/byte/webidl_syntax__Lexer.cmo -c -impl webidl/src/syntax/lexer.pp.ml)
- File "webidl/src/syntax/lexer.pp.ml", line 1:
- Warning 70 [missing-mli]: Cannot find interface file.
- File "bin/dune", line 2, characters 8-11:
- 2 |  (names gen)
-             ^^^
- (cd _build/default && /home/opam/.opam/default/bin/ocamlopt.opt -w -40 -g -o bin/gen.exe /home/opam/.opam/default/lib/base/base_internalhash_types/base_internalhash_types.cmxa -I /home/opam/.opam/default/lib/base/base_internalhash_types /home/opam/.opam/default/lib/base/caml/caml.cmxa /home/opam/.opam/default/lib/sexplib0/sexplib0.cmxa /home/opam/.opam/default/lib/base/shadow_stdlib/shadow_stdlib.cmxa /home/opam/.opam/default/lib/base/base.cmxa -I /home/opam/.opam/default/lib/base /home/opam/.opam/default/lib/ppx_sexp_conv/runtime-lib/ppx_sexp_conv_lib.cmxa /home/opam/.opam/default/lib/ppx_here/runtime-lib/ppx_here_lib.cmxa /home/opam/.opam/default/lib/ppx_inline_test/config/inline_test_config.cmxa /home/opam/.opam/default/lib/jane-street-headers/jane_street_headers.cmxa /home/opam/.opam/default/lib/ppx_compare/runtime-lib/ppx_compare_lib.cmxa /home/opam/.opam/default/lib/ppx_enumerate/runtime-lib/ppx_enumerate_lib.cmxa /home/opam/.opam/default/lib/ppx_hash/runtime-lib/ppx_hash_lib.cmxa /home/opam/.opam/default/lib/time_now/time_now.cmxa -I /home/opam/.opam/default/lib/time_now /home/opam/.opam/default/lib/ppx_inline_test/runtime-lib/ppx_inline_test_lib.cmxa /home/opam/.opam/default/lib/ppx_bench/runtime-lib/ppx_bench_lib.cmxa /home/opam/.opam/default/lib/ppx_assert/runtime-lib/ppx_assert_lib.cmxa /home/opam/.opam/default/lib/splittable_random/splittable_random.cmxa /home/opam/.opam/default/lib/fieldslib/fieldslib.cmxa /home/opam/.opam/default/lib/base_quickcheck/base_quickcheck.cmxa /home/opam/.opam/default/lib/base/md5/md5_lib.cmxa /home/opam/.opam/default/lib/variantslib/variantslib.cmxa /home/opam/.opam/default/lib/bin_prot/shape/bin_shape_lib.cmxa /home/opam/.opam/default/lib/bin_prot/bin_prot.cmxa -I /home/opam/.opam/default/lib/bin_prot /home/opam/.opam/default/lib/stdio/stdio.cmxa /home/opam/.opam/default/lib/ppx_module_timer/runtime/ppx_module_timer_runtime.cmxa /home/opam/.opam/default/lib/typerep/typerep_lib.cmxa /home/opam/.opam/default/lib/ppx_expect/common/expect_test_common.cmxa /home/opam/.opam/default/lib/ppx_expect/config_types/expect_test_config_types.cmxa /home/opam/.opam/default/lib/ppx_expect/collector/expect_test_collector.cmxa -I /home/opam/.opam/default/lib/ppx_expect/collector /home/opam/.opam/default/lib/ppx_expect/config/expect_test_config.cmxa /home/opam/.opam/default/lib/base_bigstring/base_bigstring.cmxa -I /home/opam/.opam/default/lib/base_bigstring /home/opam/.opam/default/lib/core_kernel/base_for_tests/base_for_tests.cmxa /home/opam/.opam/default/lib/ocaml/unix.cmxa -I /home/opam/.opam/default/lib/ocaml /home/opam/.opam/default/lib/ocaml/bigarray.cmxa -I /home/opam/.opam/default/lib/ocaml /home/opam/.opam/default/lib/parsexp/parsexp.cmxa /home/opam/.opam/default/lib/sexplib/sexplib.cmxa /home/opam/.opam/default/lib/core_kernel/core_kernel.cmxa -I /home/opam/.opam/default/lib/core_kernel /home/opam/.opam/default/lib/ocaml/threads/threads.cmxa -I /home/opam/.opam/default/lib/ocaml /home/opam/.opam/default/lib/core/error_checking_mutex/error_checking_mutex.cmxa -I /home/opam/.opam/default/lib/core/error_checking_mutex /home/opam/.opam/default/lib/core_kernel/caml_unix/caml_unix.cmxa /home/opam/.opam/default/lib/core_kernel/flags/flags.cmxa /home/opam/.opam/default/lib/core_kernel/version_util/version_util.cmxa -I /home/opam/.opam/default/lib/core_kernel/version_util /home/opam/.opam/default/lib/sexplib/unix/sexplib_unix.cmxa /home/opam/.opam/default/lib/spawn/spawn.cmxa -I /home/opam/.opam/default/lib/spawn /home/opam/.opam/default/lib/timezone/timezone.cmxa /home/opam/.opam/default/lib/core/core.cmxa -I /home/opam/.opam/default/lib/core /home/opam/.opam/default/lib/core_kernel/moption/moption.cmxa /home/opam/.opam/default/lib/core_kernel/tuple_pool/tuple_pool.cmxa /home/opam/.opam/default/lib/core_kernel/pairing_heap/pairing_heap.cmxa /home/opam/.opam/default/lib/core_kernel/sexp_hidden_in_test/sexp_hidden_in_test.cmxa /home/opam/.opam/default/lib/core_kernel/thread_pool_cpu_affinity/thread_pool_cpu_affinity.cmxa /home/opam/.opam/default/lib/core_kernel/uopt/uopt.cmxa /home/opam/.opam/default/lib/core_kernel/thread_safe_queue/thread_safe_queue.cmxa /home/opam/.opam/default/lib/core_kernel/timing_wheel/timing_wheel.cmxa /home/opam/.opam/default/lib/async_kernel/async_kernel.cmxa /home/opam/.opam/default/lib/core/bigstring_unix/bigstring_unix.cmxa -I /home/opam/.opam/default/lib/core/bigstring_unix /home/opam/.opam/default/lib/core_kernel/bounded_int_table/bounded_int_table.cmxa /home/opam/.opam/default/lib/core_kernel/iobuf/iobuf.cmxa /home/opam/.opam/default/lib/core/iobuf_unix/iobuf_unix.cmxa -I /home/opam/.opam/default/lib/core/iobuf_unix /home/opam/.opam/default/lib/core/nano_mutex/nano_mutex.cmxa /home/opam/.opam/default/lib/core/squeue/squeue.cmxa /home/opam/.opam/default/lib/core/linux_ext/linux_ext.cmxa -I /home/opam/.opam/default/lib/core/linux_ext /home/opam/.opam/default/lib/async_unix/thread_safe_ivar/thread_safe_ivar.cmxa /home/opam/.opam/default/lib/async_unix/thread_pool/thread_pool.cmxa /home/opam/.opam/default/lib/core/time_stamp_counter/time_stamp_counter.cmxa -I /home/opam/.opam/default/lib/core/time_stamp_counter /home/opam/.opam/default/lib/core_kernel/uuid/uuid.cmxa /home/opam/.opam/default/lib/core/uuid/uuid_unix.cmxa /home/opam/.opam/default/lib/async_unix/async_unix.cmxa -I /home/opam/.opam/default/lib/async_unix /home/opam/.opam/default/lib/async/async_command/async_command.cmxa /home/opam/.opam/default/lib/async/async_quickcheck/async_quickcheck.cmxa /home/opam/.opam/default/lib/async_kernel/persistent_connection_kernel/persistent_connection_kernel.cmxa /home/opam/.opam/default/lib/protocol_version_header/protocol_version_header.cmxa /home/opam/.opam/default/lib/async_rpc_kernel/async_rpc_kernel.cmxa /home/opam/.opam/default/lib/async/async_rpc/async_rpc.cmxa -I /home/opam/.opam/default/lib/async/async_rpc /home/opam/.opam/default/lib/async/async.cmxa -I /home/opam/.opam/default/lib/ocaml webidl/src/syntax/webidl_syntax.cmxa webidl/src/lib/webidl.cmxa /home/opam/.opam/default/lib/result/result.cmxa /home/opam/.opam/default/lib/ppx_deriving/runtime/ppx_deriving_runtime.cmxa /home/opam/.opam/default/lib/js_of_ocaml-compiler/runtime/jsoo_runtime.cmxa -I /home/opam/.opam/default/lib/js_of_ocaml-compiler/runtime /home/opam/.opam/default/lib/js_of_ocaml/js_of_ocaml.cmxa -I /home/opam/.opam/default/lib/js_of_ocaml /home/opam/.opam/default/lib/lwt/lwt.cmxa /home/opam/.opam/default/lib/js_of_ocaml-lwt/js_of_ocaml_lwt.cmxa lib/js_of_ocaml_webidl.cmxa bin/.gen.eobjs/native/dune__exe__Gen.cmx)
- /usr/bin/ld: /home/opam/.opam/default/lib/core/linux_ext/linux_ext.a(linux_ext.o): in function `camlLinux_ext__sched_setaffinity_this_thread_34469':
- /home/opam/.opam/default/.opam-switch/build/core.v0.14.1/_build/default/linux_ext/src/linux_ext.ml:697:(.text+0x4600): undefined reference to `core_unix_gettid'
- /usr/bin/ld: /home/opam/.opam/default/lib/core/linux_ext/linux_ext.a(linux_ext.o): in function `camlLinux_ext__1':
- :(.data+0x3b58): undefined reference to `core_unix_gettid'
- collect2: error: ld returned 1 exit status
- File "caml_startup", line 1:
- Error: Error during linking (exit code 1)
[ERROR] The compilation of js_of_ocaml-webidl.0.1 failed at "dune build -p js_of_ocaml-webidl -j 39 @install".
build failed... 

=== STDERR ===

2026-09-20 11:33.41: FAILED: build js_of_ocaml-webidl.0.1
2026-09-20 11:33.41: Job failed: build failed: js_of_ocaml-webidl.0.1