Build:
  1. 0
2026-09-20 10:51.57: New job: build randoml.0.1.5 (4b8fe812c6b7)
2026-09-20 10:51.57: Waiting for resource in pool day11-builds
2026-09-20 11:26.39: Got resource from pool day11-builds
2026-09-20 11:26.39: [profile full] build randoml.0.1.5
2026-09-20 11:26.39: build randoml.0.1.5 (4b8fe812c6b7)
=== DEPENDENCIES (79 transitive) ===
  base.v0.17.3                                       775793919d5d
  base-threads.base                                  ddcab511c589
  base-unix.base                                     742554e1dbc2
  base_bigstring.v0.17.0                             253a80990aef
  base_quickcheck.v0.17.1                            6192a66424eb
  bignum.v0.17.0                                     568dd8f3423f
  bin_prot.v0.17.0-1                                 4575b407c7d4
  capitalization.v0.17.0                             04f2cf56f409
  compiler-cloning.enabled                           9ab6e8146b48
  conf-gmp.5                                         00570d20295f
  conf-pkg-config.5                                  5bc8297bba82
  conf-rust-2018.1                                   dfb5bca605e0
  core.v0.17.2                                       9393799222cd
  core_kernel.v0.17.0                                e278cbafa24b
  csexp.1.5.2                                        6dfd0b7165bf
  dune.3.24.2                                        fc1180f13f25
  dune-configurator.3.24.2                           85add40e4d98
  fieldslib.v0.17.0                                  317b2ae88dbb
  gel.v0.17.0                                        f80d60844f64
  int_repr.v0.17.0                                   18c9180453ff
  jane-street-headers.v0.17.0                        b82b3fe4776d
  jst-config.v0.17.0                                 f3157d1e20a0
  num.1.6                                            6b9e767870cc
  ocaml.5.5.1                                        62cb7e73ffb1
  ocaml-base-compiler.5.5.1                          3187d6d6f452
  ocaml-compiler.5.5.1                               3af2e5d33cd9
  ocaml-compiler-libs.v0.17.0                        97197ebac9c5
  ocaml_intrinsics_kernel.v0.17.2                    b3d0417154f6
  ocamlfind.1.9.9~preview                            7593ab790e0d
  parsexp.v0.17.0                                    fdcc0ab30b78
  ppx_assert.v0.17.0                                 6a7073d3ab80
  ppx_base.v0.17.0                                   b769f061b652
  ppx_bench.v0.17.1                                  e81726758620
  ppx_bin_prot.v0.17.1                               252e7d7f7932
  ppx_cold.v0.17.0                                   ef154577ba8a
  ppx_compare.v0.17.0                                5882588b193c
  ppx_custom_printf.v0.17.0                          24f40a475ee6
  ppx_derivers.1.2.1                                 943a6854ce40
  ppx_diff.v0.17.1                                   d0f22b17bacb
  ppx_disable_unused_warnings.v0.17.0                23e636b65dd9
  ppx_enumerate.v0.17.0                              4f41e40178cf
  ppx_expect.v0.17.3                                 6bb175ec959b
  ppx_fields_conv.v0.17.0                            ddc467cedc4c
  ppx_fixed_literal.v0.17.0                          d6f48db56841
  ppx_globalize.v0.17.2                              16201f2dc269
  ppx_hash.v0.17.0                                   74ded5b9132f
  ppx_here.v0.17.0                                   0a70b567ee6a
  ppx_ignore_instrumentation.v0.17.0                 5d1ca6e31c7c
  ppx_inline_test.v0.17.1                            8443a5907597
  ppx_jane.v0.17.0                                   8595fd20cc85
  ppx_let.v0.17.1                                    12e8e2940765
  ppx_log.v0.17.0                                    1388d7c2eaba
  ppx_module_timer.v0.17.0                           306636b861cb
  ppx_optcomp.v0.17.1                                7501fcfe3085
  ppx_optional.v0.17.0                               9a89d81c73ef
  ppx_pipebang.v0.17.0                               89b96d0db846
  ppx_sexp_conv.v0.17.1                              a352228be915
  ppx_sexp_message.v0.17.0                           a00afb22c6f9
  ppx_sexp_value.v0.17.0                             e5a0520aca06
  ppx_stable.v0.17.1                                 ebeb4a0b6e1f
  ppx_stable_witness.v0.17.0                         4064b0955839
  ppx_string.v0.17.0                                 e79654750fc0
  ppx_string_conv.v0.17.0                            d63cbee976fb
  ppx_tydi.v0.17.1                                   15123b43663a
  ppx_typerep_conv.v0.17.1                           c338e62b8835
  ppx_variants_conv.v0.17.1                          744450888cfb
  ppxlib.0.38.0                                      8334b285b58e
  ppxlib_jane.v0.17.4                                0d3140ec3b84
  sexplib.v0.17.0                                    d81bad4207e7
  sexplib0.v0.17.0                                   a3540be0a3a9
  splittable_random.v0.17.0                          1d7f1683e4eb
  stdio.v0.17.0                                      b53a3af2065d
  stdlib-shims.0.3.0                                 1941f34b811d
  time_now.v0.17.0                                   23c0da123472
  typerep.v0.17.1                                    465d951dc821
  uopt.v0.17.0                                       498d9cbe2ab1
  variantslib.v0.17.0                                a8ef47ca23be
  zarith.1.14                                        7dd741cbd805
  zarith_stubs_js.v0.17.0                            c7fd1cef282d
=== STDOUT ===
Processing: [default: loading data]
[randoml.0.1.5: dl]
[randoml.0.1.5: extract]
-> retrieved randoml.0.1.5  (https://opam.ocaml.org/cache)
[randoml: dune build]
+ /home/opam/.opam/default/bin/dune "build" "-p" "randoml" "-j" "39" "@install" (CWD=/home/opam/.opam/default/.opam-switch/build/randoml.0.1.5)
- (cd _build/default && /home/opam/.opam/default/bin/ocamlc.opt -w -40 -g -bin-annot -bin-annot-occurrences -I lib/.randoml.objs/byte -I /home/opam/.opam/default/lib/base -I /home/opam/.opam/default/lib/base/base_internalhash_types -I /home/opam/.opam/default/lib/base/md5 -I /home/opam/.opam/default/lib/base/shadow_stdlib -I /home/opam/.opam/default/lib/base_bigstring -I /home/opam/.opam/default/lib/base_quickcheck -I /home/opam/.opam/default/lib/base_quickcheck/ppx_quickcheck/runtime -I /home/opam/.opam/default/lib/bignum/bigint -I /home/opam/.opam/default/lib/bin_prot -I /home/opam/.opam/default/lib/bin_prot/shape -I /home/opam/.opam/default/lib/core -I /home/opam/.opam/default/lib/core/base_for_tests -I /home/opam/.opam/default/lib/core/command -I /home/opam/.opam/default/lib/core/filename_base -I /home/opam/.opam/default/lib/core/heap_block -I /home/opam/.opam/default/lib/core/univ_map -I /home/opam/.opam/default/lib/core/validate -I /home/opam/.opam/default/lib/core_kernel -I /home/opam/.opam/default/lib/fieldslib -I /home/opam/.opam/default/lib/gel -I /home/opam/.opam/default/lib/int_repr -I /home/opam/.opam/default/lib/jane-street-headers -I /home/opam/.opam/default/lib/num -I /home/opam/.opam/default/lib/ocaml_intrinsics_kernel -I /home/opam/.opam/default/lib/parsexp -I /home/opam/.opam/default/lib/ppx_assert/runtime-lib -I /home/opam/.opam/default/lib/ppx_bench/runtime-lib -I /home/opam/.opam/default/lib/ppx_compare/runtime-lib -I /home/opam/.opam/default/lib/ppx_diff/diffable -I /home/opam/.opam/default/lib/ppx_diff/diffable_cinaps -I /home/opam/.opam/default/lib/ppx_enumerate/runtime-lib -I /home/opam/.opam/default/lib/ppx_expect/config -I /home/opam/.opam/default/lib/ppx_expect/config_types -I /home/opam/.opam/default/lib/ppx_expect/make_corrected_file -I /home/opam/.opam/default/lib/ppx_expect/runtime -I /home/opam/.opam/default/lib/ppx_hash/runtime-lib -I /home/opam/.opam/default/lib/ppx_here/runtime-lib -I /home/opam/.opam/default/lib/ppx_inline_test/config -I /home/opam/.opam/default/lib/ppx_inline_test/runtime-lib -I /home/opam/.opam/default/lib/ppx_log/syntax -I /home/opam/.opam/default/lib/ppx_log/types -I /home/opam/.opam/default/lib/ppx_module_timer/runtime -I /home/opam/.opam/default/lib/ppx_sexp_conv/runtime-lib -I /home/opam/.opam/default/lib/ppx_stable_witness/runtime -I /home/opam/.opam/default/lib/ppx_stable_witness/stable_witness -I /home/opam/.opam/default/lib/ppx_string/runtime -I /home/opam/.opam/default/lib/ppxlib/print_diff -I /home/opam/.opam/default/lib/sexplib -I /home/opam/.opam/default/lib/sexplib0 -I /home/opam/.opam/default/lib/splittable_random -I /home/opam/.opam/default/lib/stdio -I /home/opam/.opam/default/lib/time_now -I /home/opam/.opam/default/lib/typerep -I /home/opam/.opam/default/lib/variantslib -I /home/opam/.opam/default/lib/zarith -I /home/opam/.opam/default/lib/zarith_stubs_js -I lib/rand/.rand.objs/byte -cmi-file lib/.randoml.objs/byte/randoml.cmi -no-alias-deps -o lib/.randoml.objs/byte/randoml.cmo -c -impl lib/randoml.pp.ml)
- File "lib/randoml.ml", line 1, characters 5-16:
- 1 | open Core_kernel
-          ^^^^^^^^^^^
- Alert deprecated: module Core_kernel
- [since 2021-05] Use [Core] -- [Core_kernel] was renamed as [Core]
- (cd _build/default && /home/opam/.opam/default/bin/ocamlopt.opt -w -40 -g -I lib/.randoml.objs/byte -I lib/.randoml.objs/native -I /home/opam/.opam/default/lib/base -I /home/opam/.opam/default/lib/base/base_internalhash_types -I /home/opam/.opam/default/lib/base/md5 -I /home/opam/.opam/default/lib/base/shadow_stdlib -I /home/opam/.opam/default/lib/base_bigstring -I /home/opam/.opam/default/lib/base_quickcheck -I /home/opam/.opam/default/lib/base_quickcheck/ppx_quickcheck/runtime -I /home/opam/.opam/default/lib/bignum/bigint -I /home/opam/.opam/default/lib/bin_prot -I /home/opam/.opam/default/lib/bin_prot/shape -I /home/opam/.opam/default/lib/core -I /home/opam/.opam/default/lib/core/base_for_tests -I /home/opam/.opam/default/lib/core/command -I /home/opam/.opam/default/lib/core/filename_base -I /home/opam/.opam/default/lib/core/heap_block -I /home/opam/.opam/default/lib/core/univ_map -I /home/opam/.opam/default/lib/core/validate -I /home/opam/.opam/default/lib/core_kernel -I /home/opam/.opam/default/lib/fieldslib -I /home/opam/.opam/default/lib/gel -I /home/opam/.opam/default/lib/int_repr -I /home/opam/.opam/default/lib/jane-street-headers -I /home/opam/.opam/default/lib/num -I /home/opam/.opam/default/lib/ocaml_intrinsics_kernel -I /home/opam/.opam/default/lib/parsexp -I /home/opam/.opam/default/lib/ppx_assert/runtime-lib -I /home/opam/.opam/default/lib/ppx_bench/runtime-lib -I /home/opam/.opam/default/lib/ppx_compare/runtime-lib -I /home/opam/.opam/default/lib/ppx_diff/diffable -I /home/opam/.opam/default/lib/ppx_diff/diffable_cinaps -I /home/opam/.opam/default/lib/ppx_enumerate/runtime-lib -I /home/opam/.opam/default/lib/ppx_expect/config -I /home/opam/.opam/default/lib/ppx_expect/config_types -I /home/opam/.opam/default/lib/ppx_expect/make_corrected_file -I /home/opam/.opam/default/lib/ppx_expect/runtime -I /home/opam/.opam/default/lib/ppx_hash/runtime-lib -I /home/opam/.opam/default/lib/ppx_here/runtime-lib -I /home/opam/.opam/default/lib/ppx_inline_test/config -I /home/opam/.opam/default/lib/ppx_inline_test/runtime-lib -I /home/opam/.opam/default/lib/ppx_log/syntax -I /home/opam/.opam/default/lib/ppx_log/types -I /home/opam/.opam/default/lib/ppx_module_timer/runtime -I /home/opam/.opam/default/lib/ppx_sexp_conv/runtime-lib -I /home/opam/.opam/default/lib/ppx_stable_witness/runtime -I /home/opam/.opam/default/lib/ppx_stable_witness/stable_witness -I /home/opam/.opam/default/lib/ppx_string/runtime -I /home/opam/.opam/default/lib/ppxlib/print_diff -I /home/opam/.opam/default/lib/sexplib -I /home/opam/.opam/default/lib/sexplib0 -I /home/opam/.opam/default/lib/splittable_random -I /home/opam/.opam/default/lib/stdio -I /home/opam/.opam/default/lib/time_now -I /home/opam/.opam/default/lib/typerep -I /home/opam/.opam/default/lib/variantslib -I /home/opam/.opam/default/lib/zarith -I /home/opam/.opam/default/lib/zarith_stubs_js -I lib/rand/.rand.objs/byte -I lib/rand/.rand.objs/native -cmi-file lib/.randoml.objs/byte/randoml.cmi -no-alias-deps -o lib/.randoml.objs/native/randoml.cmx -c -impl lib/randoml.pp.ml)
- File "lib/randoml.ml", line 1, characters 5-16:
- 1 | open Core_kernel
-          ^^^^^^^^^^^
- Alert deprecated: module Core_kernel
- [since 2021-05] Use [Core] -- [Core_kernel] was renamed as [Core]
- File "lib/rand/dune", lines 7-26, characters 0-671:
-  7 | (rule
-  8 |  (targets librand.a dllrand.so)
-  9 |  (deps
- ....
- 24 |     -c
- 25 |     "mv target/release/librand.so ./dllrand.so 2> /dev/null || mv target/release/librand.dylib ./dllrand.so 2> /dev/null || touch dllrand.so")
- 26 |    (run cp target/release/librand.a .))))
- (cd _build/default/lib/rand && /usr/bin/cargo build --release --offline)
-    Compiling proc-macro2 v1.0.27
-    Compiling unicode-xid v0.2.2
-    Compiling libc v0.2.97
-    Compiling cc v1.0.68
-    Compiling syn v1.0.73
-    Compiling ocaml-sys v0.20.1
-    Compiling ocaml-boxroot-sys v0.2.0
-    Compiling cfg-if v1.0.0
-    Compiling cty v0.2.1
-    Compiling ocaml-sys v0.22.0
- warning: ocaml-boxroot-sys@0.2.0: vendor/boxroot/boxroot.c:23:10: fatal error: caml/compact.h: No such file or directory
- warning: ocaml-boxroot-sys@0.2.0:    23 | #include <caml/compact.h>
- warning: ocaml-boxroot-sys@0.2.0:       |          ^~~~~~~~~~~~~~~~
- warning: ocaml-boxroot-sys@0.2.0: compilation terminated.
- error: failed to run custom build command for `ocaml-boxroot-sys v0.2.0`
- 
- Caused by:
-   process didn't exit successfully: `/home/opam/.opam/default/.opam-switch/build/randoml.0.1.5/_build/default/lib/rand/target/release/build/ocaml-boxroot-sys-6f7441702399e165/build-script-build` (exit status: 1)
-   --- stdout
-   cargo:rerun-if-changed=vendor/boxroot/boxroot.c
-   cargo:rerun-if-changed=vendor/boxroot/boxroot.h
-   cargo:rerun-if-env-changed=OCAMLOPT
-   cargo:rerun-if-env-changed=OCAML_WHERE_PATH
-   TARGET = Some("x86_64-unknown-linux-gnu")
-   OPT_LEVEL = Some("3")
-   HOST = Some("x86_64-unknown-linux-gnu")
-   CC_x86_64-unknown-linux-gnu = None
-   CC_x86_64_unknown_linux_gnu = None
-   HOST_CC = None
-   CC = None
-   CFLAGS_x86_64-unknown-linux-gnu = None
-   CFLAGS_x86_64_unknown_linux_gnu = None
-   HOST_CFLAGS = None
-   CFLAGS = None
-   CRATE_CC_NO_DEFAULTS = None
-   DEBUG = Some("false")
-   CARGO_CFG_TARGET_FEATURE = Some("fxsr,sse,sse2")
-   running: "cc" "-O3" "-ffunction-sections" "-fdata-sections" "-fPIC" "-m64" "-I" "/home/opam/.opam/default/lib/ocaml" "-I" "vendor/boxroot/" "-Wall" "-Wextra" "-o" "/home/opam/.opam/default/.opam-switch/build/randoml.0.1.5/_build/default/lib/rand/target/release/build/ocaml-boxroot-sys-27e7b736356b61c0/out/vendor/boxroot/boxroot.o" "-c" "vendor/boxroot/boxroot.c"
-   cargo:warning=vendor/boxroot/boxroot.c:23:10: fatal error: caml/compact.h: No such file or directory
-   cargo:warning=   23 | #include <caml/compact.h>
-   cargo:warning=      |          ^~~~~~~~~~~~~~~~
-   cargo:warning=compilation terminated.
-   exit status: 1
- 
-   --- stderr
- 
- 
-   error occurred: Command "cc" "-O3" "-ffunction-sections" "-fdata-sections" "-fPIC" "-m64" "-I" "/home/opam/.opam/default/lib/ocaml" "-I" "vendor/boxroot/" "-Wall" "-Wextra" "-o" "/home/opam/.opam/default/.opam-switch/build/randoml.0.1.5/_build/default/lib/rand/target/release/build/ocaml-boxroot-sys-27e7b736356b61c0/out/vendor/boxroot/boxroot.o" "-c" "vendor/boxroot/boxroot.c" with args "cc" did not execute successfully (status code exit status: 1).
- 
- 
- warning: build failed, waiting for other jobs to finish...
[ERROR] The compilation of randoml.0.1.5 failed at "dune build -p randoml -j 39 @install".
build failed... 

=== STDERR ===

2026-09-20 11:28.59: FAILED: build randoml.0.1.5
2026-09-20 11:28.59: Job failed: build failed: randoml.0.1.5