Build:
  1. 0
2026-09-20 10:51.36: New job: build janestreet_cpuid.v0.17.0 (bdaf65b8b701)
2026-09-20 10:51.36: Waiting for resource in pool day11-builds
2026-09-20 11:26.38: Got resource from pool day11-builds
2026-09-20 11:26.38: [profile full] build janestreet_cpuid.v0.17.0
2026-09-20 11:26.38: build janestreet_cpuid.v0.17.0 (bdaf65b8b701)
=== DEPENDENCIES (72 transitive) ===
  base.v0.17.3                                       775793919d5d
  base-threads.base                                  ddcab511c589
  base-unix.base                                     742554e1dbc2
  base_bigstring.v0.17.0                             253a80990aef
  base_quickcheck.v0.17.1                            6192a66424eb
  bin_prot.v0.17.0-1                                 4575b407c7d4
  capitalization.v0.17.0                             04f2cf56f409
  compiler-cloning.enabled                           9ab6e8146b48
  core.v0.17.2                                       9393799222cd
  core_kernel.v0.17.0                                e278cbafa24b
  csexp.1.5.2                                        6dfd0b7165bf
  dune.3.24.2                                        fc1180f13f25
  dune-configurator.3.24.2                           85add40e4d98
  fieldslib.v0.17.0                                  317b2ae88dbb
  gel.v0.17.0                                        f80d60844f64
  int_repr.v0.17.0                                   18c9180453ff
  jane-street-headers.v0.17.0                        b82b3fe4776d
  jst-config.v0.17.0                                 f3157d1e20a0
  num.1.6                                            6b9e767870cc
  ocaml.5.5.1                                        62cb7e73ffb1
  ocaml-base-compiler.5.5.1                          3187d6d6f452
  ocaml-compiler.5.5.1                               3af2e5d33cd9
  ocaml-compiler-libs.v0.17.0                        97197ebac9c5
  ocaml_intrinsics_kernel.v0.17.2                    b3d0417154f6
  parsexp.v0.17.0                                    fdcc0ab30b78
  ppx_assert.v0.17.0                                 6a7073d3ab80
  ppx_base.v0.17.0                                   b769f061b652
  ppx_bench.v0.17.1                                  e81726758620
  ppx_bin_prot.v0.17.1                               252e7d7f7932
  ppx_cold.v0.17.0                                   ef154577ba8a
  ppx_compare.v0.17.0                                5882588b193c
  ppx_custom_printf.v0.17.0                          24f40a475ee6
  ppx_derivers.1.2.1                                 943a6854ce40
  ppx_diff.v0.17.1                                   d0f22b17bacb
  ppx_disable_unused_warnings.v0.17.0                23e636b65dd9
  ppx_enumerate.v0.17.0                              4f41e40178cf
  ppx_expect.v0.17.3                                 6bb175ec959b
  ppx_fields_conv.v0.17.0                            ddc467cedc4c
  ppx_fixed_literal.v0.17.0                          d6f48db56841
  ppx_globalize.v0.17.2                              16201f2dc269
  ppx_hash.v0.17.0                                   74ded5b9132f
  ppx_here.v0.17.0                                   0a70b567ee6a
  ppx_ignore_instrumentation.v0.17.0                 5d1ca6e31c7c
  ppx_inline_test.v0.17.1                            8443a5907597
  ppx_jane.v0.17.0                                   8595fd20cc85
  ppx_let.v0.17.1                                    12e8e2940765
  ppx_log.v0.17.0                                    1388d7c2eaba
  ppx_module_timer.v0.17.0                           306636b861cb
  ppx_optcomp.v0.17.1                                7501fcfe3085
  ppx_optional.v0.17.0                               9a89d81c73ef
  ppx_pipebang.v0.17.0                               89b96d0db846
  ppx_sexp_conv.v0.17.1                              a352228be915
  ppx_sexp_message.v0.17.0                           a00afb22c6f9
  ppx_sexp_value.v0.17.0                             e5a0520aca06
  ppx_stable.v0.17.1                                 ebeb4a0b6e1f
  ppx_stable_witness.v0.17.0                         4064b0955839
  ppx_string.v0.17.0                                 e79654750fc0
  ppx_string_conv.v0.17.0                            d63cbee976fb
  ppx_tydi.v0.17.1                                   15123b43663a
  ppx_typerep_conv.v0.17.1                           c338e62b8835
  ppx_variants_conv.v0.17.1                          744450888cfb
  ppxlib.0.38.0                                      8334b285b58e
  ppxlib_jane.v0.17.4                                0d3140ec3b84
  sexplib.v0.17.0                                    d81bad4207e7
  sexplib0.v0.17.0                                   a3540be0a3a9
  splittable_random.v0.17.0                          1d7f1683e4eb
  stdio.v0.17.0                                      b53a3af2065d
  stdlib-shims.0.3.0                                 1941f34b811d
  time_now.v0.17.0                                   23c0da123472
  typerep.v0.17.1                                    465d951dc821
  uopt.v0.17.0                                       498d9cbe2ab1
  variantslib.v0.17.0                                a8ef47ca23be
=== STDOUT ===
Processing: [default: loading data]
[janestreet_cpuid.v0.17.0: dl]
[janestreet_cpuid.v0.17.0: extract]
-> retrieved janestreet_cpuid.v0.17.0  (https://opam.ocaml.org/cache)
[janestreet_cpuid: dune build]
+ /home/opam/.opam/default/bin/dune "build" "-p" "janestreet_cpuid" "-j" "39" (CWD=/home/opam/.opam/default/.opam-switch/build/janestreet_cpuid.v0.17.0)
- File "src/dune", line 4, characters 9-20:
- 4 |   (names cpuid_stubs)
-              ^^^^^^^^^^^
- (cd _build/default/src && /usr/bin/gcc -O2 -fno-strict-aliasing -fwrapv -fPIC -pthread -D_FILE_OFFSET_BITS=64 -Wall -fdiagnostics-color=always -g -I /home/opam/.opam/default/lib/ocaml -I /home/opam/.opam/default/lib/base -I /home/opam/.opam/default/lib/base/base_internalhash_types -I /home/opam/.opam/default/lib/base/md5 -I /home/opam/.opam/default/lib/base/shadow_stdlib -I /home/opam/.opam/default/lib/base_bigstring -I /home/opam/.opam/default/lib/base_quickcheck -I /home/opam/.opam/default/lib/base_quickcheck/ppx_quickcheck/runtime -I /home/opam/.opam/default/lib/bin_prot -I /home/opam/.opam/default/lib/bin_prot/shape -I /home/opam/.opam/default/lib/core -I /home/opam/.opam/default/lib/core/base_for_tests -I /home/opam/.opam/default/lib/core/command -I /home/opam/.opam/default/lib/core/filename_base -I /home/opam/.opam/default/lib/core/heap_block -I /home/opam/.opam/default/lib/core/univ_map -I /home/opam/.opam/default/lib/core/validate -I /home/opam/.opam/default/lib/core_kernel/flags -I /home/opam/.opam/default/lib/fieldslib -I /home/opam/.opam/default/lib/gel -I /home/opam/.opam/default/lib/int_repr -I /home/opam/.opam/default/lib/jane-street-headers -I /home/opam/.opam/default/lib/ocaml_intrinsics_kernel -I /home/opam/.opam/default/lib/parsexp -I /home/opam/.opam/default/lib/ppx_assert/runtime-lib -I /home/opam/.opam/default/lib/ppx_bench/runtime-lib -I /home/opam/.opam/default/lib/ppx_compare/runtime-lib -I /home/opam/.opam/default/lib/ppx_diff/diffable -I /home/opam/.opam/default/lib/ppx_diff/diffable_cinaps -I /home/opam/.opam/default/lib/ppx_enumerate/runtime-lib -I /home/opam/.opam/default/lib/ppx_expect/config -I /home/opam/.opam/default/lib/ppx_expect/config_types -I /home/opam/.opam/default/lib/ppx_expect/make_corrected_file -I /home/opam/.opam/default/lib/ppx_expect/runtime -I /home/opam/.opam/default/lib/ppx_hash/runtime-lib -I /home/opam/.opam/default/lib/ppx_here/runtime-lib -I /home/opam/.opam/default/lib/ppx_inline_test/config -I /home/opam/.opam/default/lib/ppx_inline_test/runtime-lib -I /home/opam/.opam/default/lib/ppx_log/syntax -I /home/opam/.opam/default/lib/ppx_log/types -I /home/opam/.opam/default/lib/ppx_module_timer/runtime -I /home/opam/.opam/default/lib/ppx_sexp_conv/runtime-lib -I /home/opam/.opam/default/lib/ppx_stable_witness/runtime -I /home/opam/.opam/default/lib/ppx_stable_witness/stable_witness -I /home/opam/.opam/default/lib/ppx_string/runtime -I /home/opam/.opam/default/lib/ppxlib/print_diff -I /home/opam/.opam/default/lib/sexplib -I /home/opam/.opam/default/lib/sexplib0 -I /home/opam/.opam/default/lib/splittable_random -I /home/opam/.opam/default/lib/stdio -I /home/opam/.opam/default/lib/time_now -I /home/opam/.opam/default/lib/typerep -I /home/opam/.opam/default/lib/variantslib -o cpuid_stubs.o -c cpuid_stubs.c)
- cpuid_stubs.c: In function 'cpuid_arbitrary_leaf_and_subleaf':
- cpuid_stubs.c:33:12: error: implicit declaration of function 'caml_alloc_local'; did you mean 'caml_alloc_final'? [-Wimplicit-function-declaration]
-    33 |   result = caml_alloc_local(4, 0);
-       |            ^~~~~~~~~~~~~~~~
-       |            caml_alloc_final
[ERROR] The compilation of janestreet_cpuid.v0.17.0 failed at "dune build -p janestreet_cpuid -j 39".
build failed... 

=== STDERR ===

2026-09-20 11:28.59: FAILED: build janestreet_cpuid.v0.17.0
2026-09-20 11:28.59: Job failed: build failed: janestreet_cpuid.v0.17.0