Build:
  1. 0
2026-09-20 03:26.54: New job: build key-parsers.0.9.2 (322c3d9e0296)
2026-09-20 03:26.54: Waiting for resource in pool day11-builds
2026-09-20 04:42.49: Got resource from pool day11-builds
2026-09-20 04:42.49: [profile full] build key-parsers.0.9.2
2026-09-20 04:42.49: build key-parsers.0.9.2 (322c3d9e0296)
=== DEPENDENCIES (45 transitive) ===
  asn1-combinators.0.2.5                             1f520d2c824e
  base.v0.14.4                                       a8d9bd40f0a4
  base-threads.base                                  ddcab511c589
  base-unix.base                                     742554e1dbc2
  bigarray-compat.1.1.0                              4f62192440dd
  bin_prot.v0.14.1                                   3fac226f2211
  conf-gmp.5                                         00570d20295f
  conf-pkg-config.5                                  5bc8297bba82
  cppo.1.8.0                                         21d096f960e3
  csexp.1.5.2                                        9f4d58d745bb
  cstruct.5.2.0                                      2c3780dd64b4
  dune.3.22.2                                        61814409ee00
  dune-configurator.3.22.2                           812783f5ec19
  fieldslib.v0.14.0                                  3b611d6d527a
  hex.1.5.0                                          54c56b466ffd
  ocaml.4.12.1                                       c1955d2a80c0
  ocaml-base-compiler.4.12.1                         508946109b41
  ocaml-compiler-libs.v0.12.4                        3ca68cfdabf3
  ocaml-config.2                                     1f050df2f239
  ocaml-migrate-parsetree.1.8.0                      fde52f6228f9
  ocamlbuild.0.16.1                                  b239da223cfa
  ocamlfind.1.9.8                                    deb2893a58c4
  ppx_bin_prot.v0.14.0                               c364c010a183
  ppx_compare.v0.14.0                                ed1c3d304542
  ppx_custom_printf.v0.14.0                          5b65129194ef
  ppx_derivers.1.2.1                                 9f1708951143
  ppx_deriving.4.5-1                                 f58b621e9b47
  ppx_deriving_yojson.3.5.3                          e70d1166cc4e
  ppx_fields_conv.v0.14.1                            36b58cecf64b
  ppx_here.v0.14.0                                   509c6fb98e26
  ppx_optcomp.v0.14.0                                beca2bbbd2c7
  ppx_sexp_conv.v0.14.1                              720e8e9334b5
  ppx_tools.6.6                                      3f23e8a9670f
  ppx_variants_conv.v0.14.1                          9b1a58dbc8c6
  ppxfind.1.4                                        0bf9d85d4bac
  ppxlib.0.15.0                                      b8e25de92af9
  ptime.0.8.5                                        87a33f1ce836
  result.1.5                                         2ab77fd9bb77
  sexplib0.v0.14.0                                   1d4978888cdf
  stdio.v0.14.0                                      c3116861ddbb
  stdlib-shims.0.3.0                                 ff722bdece63
  topkg.1.1.1                                        2257cbe6d6b4
  variantslib.v0.14.0                                4f049fc463b2
  yojson.3.0.0                                       3a4b0dc6e224
  zarith.1.14                                        214aff937bfd
=== STDOUT ===
Processing: [default: loading data]
[key-parsers.0.9.2: dl]
[key-parsers.0.9.2: extract]
-> retrieved key-parsers.0.9.2  (https://opam.ocaml.org/cache)
[key-parsers: ocaml build]
+ /home/opam/.opam/default/bin/ocaml "pkg/pkg.ml" "build" "--pinned" "false" (CWD=/home/opam/.opam/default/.opam-switch/build/key-parsers.0.9.2)
- + ocamlfind ocamlc -config
- + ocamlfind ocamldep -package ppx_deriving_yojson -package ppx_bin_prot -package zarith -package str -package result -package ppx_deriving -package ppx_deriving.std -package ppx_deriving_yojson.runtime -package hex -package bin_prot -package asn1-combinators -modules src/kp_asn1.ml > src/kp_asn1.ml.depends
- + ocamlfind ocamldep -package ppx_deriving_yojson -package ppx_bin_prot -package zarith -package str -package result -package ppx_deriving -package ppx_deriving.std -package ppx_deriving_yojson.runtime -package hex -package bin_prot -package asn1-combinators -modules src/kp_derivable.mli > src/kp_derivable.mli.depends
- + ocamlfind ocamlc -c -g -bin-annot -safe-string -package ppx_deriving_yojson -package ppx_bin_prot -package zarith -package str -package result -package ppx_deriving -package ppx_deriving.std -package ppx_deriving_yojson.runtime -package hex -package bin_prot -package asn1-combinators -I src -o src/kp_derivable.cmi src/kp_derivable.mli
- + ocamlfind ocamlc -c -g -bin-annot -safe-string -package ppx_deriving_yojson -package ppx_bin_prot -package zarith -package str -package result -package ppx_deriving -package ppx_deriving.std -package ppx_deriving_yojson.runtime -package hex -package bin_prot -package asn1-combinators -I src -o src/kp_derivable.cmi src/kp_derivable.mli
- File "src/kp_derivable.mli", line 15, characters 23-39:
- 15 |   val to_yojson : t -> Yojson.Safe.json
-                             ^^^^^^^^^^^^^^^^
- Error: Unbound type constructor Yojson.Safe.json
- Command exited with code 2.
- pkg.ml: [ERROR] cmd ['ocamlbuild' '-use-ocamlfind' '-classic-display' '-j' '4' '-tag' 'debug'
-      '-build-dir' '_build' 'pkg.otarget']: exited with 10
[ERROR] The compilation of key-parsers.0.9.2 failed at "ocaml pkg/pkg.ml build --pinned false".
build failed... 

=== STDERR ===

2026-09-20 04:42.58: FAILED: build key-parsers.0.9.2
2026-09-20 04:42.58: Job failed: build failed: key-parsers.0.9.2