Build:
  1. 0
2026-09-20 03:10.58: New job: build gluon.0.0.9 (d783a6d263de)
2026-09-20 03:10.58: Waiting for resource in pool day11-builds
2026-09-20 04:28.42: Got resource from pool day11-builds
2026-09-20 04:28.42: [profile full] build gluon.0.0.9
2026-09-20 04:28.42: build gluon.0.0.9 (d783a6d263de)
=== DEPENDENCIES (35 transitive) ===
  angstrom.0.16.1                                    43fd040f9243
  base-threads.base                                  ddcab511c589
  base-unix.base                                     742554e1dbc2
  bigstringaf.0.10.0                                 087453e8e8fd
  bytestring.0.0.8                                   19d2dca1bbe9
  colors.0.0.1                                       b5d081c38086
  config.0.0.3                                       837643f4ffe4
  csexp.1.5.2                                        0b0af13836ad
  cstruct.6.3.0                                      0b1400380a93
  dune.3.24.2                                        257948466020
  dune-configurator.3.24.2                           bc789a5d6376
  fmt.0.11.0                                         804e1f5ca6e1
  gen.1.1                                            37651dec007e
  libc.0.0.1                                         27a899177bdc
  ocaml.5.3.0                                        55734ab946ce
  ocaml-base-compiler.5.3.0                          82e869b248a7
  ocaml-compiler.5.3.0                               da258b07979d
  ocaml-compiler-libs.v0.17.0                        e102d6248307
  ocaml-config.3                                     8839a7892a4d
  ocaml-syntax-shims.1.0.0                           ee1a2499886c
  ocamlbuild.0.16.1                                  8c613d0fe7e9
  ocamlfind.1.9.8                                    0cf2f5e2b174
  ppx_derivers.1.2.1                                 32a69341acfd
  ppxlib.0.35.0                                      8e0a3d070ded
  rio.0.0.8                                          86258cbfc96f
  sedlex.3.7                                         c37aa7ffb3fe
  seq.base                                           872048fd9bba
  sexplib0.v0.17.0                                   666aea651c23
  spices.0.0.2                                       700665b7de64
  stdlib-shims.0.3.0                                 335533c08cc7
  stringext.1.6.0                                    cb673f351376
  topkg.1.1.1                                        db641ac9eb8a
  tty.0.0.2                                          8f12d6298ac1
  uri.4.4.0                                          89bb6d5dd77b
  uutf.1.0.4                                         963a55b978cf
=== STDOUT ===
Processing: [default: loading data]
[gluon.0.0.9: dl]
[gluon.0.0.9: extract]
-> retrieved gluon.0.0.9  (https://opam.ocaml.org/cache)
[gluon: dune build]
+ /home/opam/.opam/default/bin/dune "build" "-p" "gluon" "-j" "39" "@install" (CWD=/home/opam/.opam/default/.opam-switch/build/gluon.0.0.9)
- File "gluon/sys/unix/dune", line 11, characters 41-57:
- 11 |   (names gluon_unix_io gluon_unix_kqueue gluon_unix_epoll)
-                                               ^^^^^^^^^^^^^^^^
- (cd _build/default/gluon/sys/unix && /usr/bin/gcc -O2 -fno-strict-aliasing -fwrapv -fPIC -pthread -D_FILE_OFFSET_BITS=64 -Wall -fdiagnostics-color=always -O2 -g -I /home/opam/.opam/default/lib/ocaml -I /home/opam/.opam/default/lib/libc -I /home/opam/.opam/default/lib/ocaml/unix -I ../../common -I ../../events -o gluon_unix_epoll.o -c gluon_unix_epoll.c)
- gluon_unix_epoll.c: In function 'gluon_unix_epoll_ctl':
- gluon_unix_epoll.c:73:20: error: assignment to 'uint64_t' {aka 'long unsigned int'} from 'value *' {aka 'long int *'} makes integer from pointer without a cast [-Wint-conversion]
-    73 |     event.data.u64 = ocaml_value;
-       |                    ^
[ERROR] The compilation of gluon.0.0.9 failed at "dune build -p gluon -j 39 @install".
build failed... 

=== STDERR ===

2026-09-20 04:29.49: FAILED: build gluon.0.0.9
2026-09-20 04:29.49: Job failed: build failed: gluon.0.0.9