Build:
  1. 0
2026-09-20 02:15.41: New job: build gluon.0.0.9 (b3f9fdb59dac)
2026-09-20 02:15.41: Waiting for resource in pool day11-builds
2026-09-20 03:27.29: Got resource from pool day11-builds
2026-09-20 03:27.29: [profile full] build gluon.0.0.9
2026-09-20 03:27.29: build gluon.0.0.9 (b3f9fdb59dac)
=== DEPENDENCIES (35 transitive) ===
  angstrom.0.16.1                                    0aa29a655b47
  base-threads.base                                  ddcab511c589
  base-unix.base                                     742554e1dbc2
  bigstringaf.0.10.0                                 e36d1623b5f9
  bytestring.0.0.8                                   0cc469c2e338
  cmdliner.2.1.1                                     428d3d44ff0f
  colors.0.0.1                                       c4a96f5c6de6
  config.0.0.3                                       a1c8e039eb69
  csexp.1.5.2                                        567174e38b4a
  cstruct.6.3.0                                      393b6ac7af28
  dune.3.24.2                                        85feefa88647
  dune-configurator.3.24.2                           286f76290563
  fmt.0.11.0                                         d422b35865a4
  gen.1.1                                            6983e6a24ab7
  libc.0.0.1                                         e668271dc3d0
  ocaml.5.2.1                                        b42e4e1b7a7f
  ocaml-base-compiler.5.2.1                          a46ae1516fce
  ocaml-compiler-libs.v0.17.0                        d9e7add20771
  ocaml-config.3                                     e93b3fcbaf51
  ocaml-syntax-shims.1.0.0                           c1865c6dc87b
  ocamlbuild.0.16.1                                  782bf494a2e5
  ocamlfind.1.9.8                                    7420d4eef490
  ppx_derivers.1.2.1                                 338da8dbbe99
  ppxlib.0.35.0                                      62ab2230a2fb
  rio.0.0.8                                          26da27b44df1
  sedlex.3.7                                         6dcfb684644b
  seq.base                                           e50a2bbab925
  sexplib0.v0.17.0                                   3216f22591e6
  spices.0.0.2                                       cc4c33865f20
  stdlib-shims.0.3.0                                 550da1706c31
  stringext.1.6.0                                    57a113373629
  topkg.1.1.1                                        5f5576c02b01
  tty.0.0.2                                          7d1a02dc79c1
  uri.4.4.0                                          4175e561585f
  uutf.1.0.4                                         608a131647a9
=== STDOUT ===
Processing: [default: loading data]
[gluon.0.0.9: dl]
[gluon.0.0.9: extract]
-> retrieved gluon.0.0.9  (https://opam.ocaml.org/cache)
[gluon: dune build]
+ /home/opam/.opam/default/bin/dune "build" "-p" "gluon" "-j" "39" "@install" (CWD=/home/opam/.opam/default/.opam-switch/build/gluon.0.0.9)
- File "gluon/sys/unix/dune", line 11, characters 41-57:
- 11 |   (names gluon_unix_io gluon_unix_kqueue gluon_unix_epoll)
-                                               ^^^^^^^^^^^^^^^^
- (cd _build/default/gluon/sys/unix && /usr/bin/gcc -O2 -fno-strict-aliasing -fwrapv -pthread -fPIC -pthread -D_FILE_OFFSET_BITS=64 -Wall -fdiagnostics-color=always -O2 -g -I /home/opam/.opam/default/lib/ocaml -I /home/opam/.opam/default/lib/libc -I /home/opam/.opam/default/lib/ocaml/unix -I ../../common -I ../../events -o gluon_unix_epoll.o -c gluon_unix_epoll.c)
- gluon_unix_epoll.c: In function 'gluon_unix_epoll_ctl':
- gluon_unix_epoll.c:73:20: error: assignment to 'uint64_t' {aka 'long unsigned int'} from 'value *' {aka 'long int *'} makes integer from pointer without a cast [-Wint-conversion]
-    73 |     event.data.u64 = ocaml_value;
-       |                    ^
[ERROR] The compilation of gluon.0.0.9 failed at "dune build -p gluon -j 39 @install".
build failed... 

=== STDERR ===

2026-09-20 03:29.45: FAILED: build gluon.0.0.9
2026-09-20 03:29.45: Job failed: build failed: gluon.0.0.9