Build:
  1. 0
2026-09-20 02:03.13: New job: build zxcvbn.2.3+2 (8c40488ecfa7)
2026-09-20 02:03.13: Waiting for resource in pool day11-builds
2026-09-20 03:22.52: Got resource from pool day11-builds
2026-09-20 03:22.52: [profile full] build zxcvbn.2.3+2
2026-09-20 03:22.52: build zxcvbn.2.3+2 (8c40488ecfa7)
=== DEPENDENCIES (16 transitive) ===
  base-threads.base                                  ddcab511c589
  base-unix.base                                     742554e1dbc2
  cppo.1.8.0                                         a31615964db5
  dune.3.24.2                                        6dfe5470779b
  ocaml.4.12.1                                       c1955d2a80c0
  ocaml-base-compiler.4.12.1                         508946109b41
  ocaml-config.2                                     1f050df2f239
  ocaml-migrate-parsetree.1.8.0                      80c48c349bae
  ocaml-secondary-compiler.4.14.2                    e2a22285b593
  ocamlfind.1.9.6                                    d8e3ff7f66c6
  ocamlfind-secondary.1.9.6                          06f018ee18a5
  ppx_derivers.1.2.1                                 1fba1ff38ff5
  ppx_deriving.4.5-1                                 e96a572a441c
  ppx_tools.6.6                                      a46747d499a5
  ppxfind.1.4                                        5acd3da9c2d7
  result.1.5                                         8d9147902c9a
=== STDOUT ===
Processing: [default: loading data]
[zxcvbn.2.3+2: dl]
[zxcvbn.2.3+2: extract]
-> retrieved zxcvbn.2.3+2  (https://opam.ocaml.org/cache)
[zxcvbn: dune build]
+ /home/opam/.opam/default/bin/dune "build" "-p" "zxcvbn" "-j" "39" (CWD=/home/opam/.opam/default/.opam-switch/build/zxcvbn.2.3+2)
- File "src/dune", line 3, characters 24-30:
- 3 |   (c_names zxcvbn_stubs zxcvbn)
-                             ^^^^^^
- (cd _build/default/src && /usr/bin/gcc -O2 -fno-strict-aliasing -fwrapv -fPIC -D_FILE_OFFSET_BITS=64 -D_REENTRANT -O2 -fno-strict-aliasing -fwrapv -fPIC '-I .' -g -I /home/opam/.opam/default/lib/ocaml -I /home/opam/.opam/default/lib/ppx_deriving/runtime -I /home/opam/.opam/default/lib/result -o zxcvbn.o -c zxcvbn.c)
- zxcvbn.c:25:10: fatal error: zxcvbn.h: No such file or directory
-    25 | #include <zxcvbn.h>
-       |          ^~~~~~~~~~
- compilation terminated.
[ERROR] The compilation of zxcvbn.2.3+2 failed at "dune build -p zxcvbn -j 39".
build failed... 

=== STDERR ===

2026-09-20 03:23.05: FAILED: build zxcvbn.2.3+2
2026-09-20 03:23.05: Job failed: build failed: zxcvbn.2.3+2